program: Orca
programVersion: 5.0.2
elementType: Si F O O C C C C C C C C C C C C C C C C C C C C C C C C C H H H H H H H H H H H H H H H H H H H H H H H H H H H H H
charge: 0
multiplicity: 1
keywords: wb97x-d3
keywords: def2-TZVPP
keywords: def2/J RIJCOSX
keywords: DEFGRID2
keywords: scfconv7
keywords: smallprint printgap noloewdin
keywords: NOSOSCF
formula: C25H29FO2Si
InChI: InChI=1/C25H29FO2Si/c1-4-27-21-13-15-23(16-14-21)29(2,3)18-8-9-20-12-17-24(26)25(19-20)28-22-10-6-5-7-11-22/h5-7,10-17,19H,4,8-9,18H2,1-3H3
58 atoms
Si -3.990246 1.08835 0.81054
F  2.008073 -1.93223 1.235573
O  1.909455 2.401443 0.788319
O  1.612993 -0.275684 -0.926249
C  -4.119527 -0.682453 0.160083
C  -3.64312 -0.810074 -1.293816
C  -2.165354 1.520862 0.827077
C  -4.686974 1.187613 2.559211
C  -4.922168 2.269391 -0.323891
C  -2.854992 -2.093869 -1.57925
C  -1.594226 2.453956 -0.04265
C  -1.297863 0.874685 1.704861
C  -1.538731 -2.112753 -0.851008
C  -0.239841 2.729708 -0.034302
C  0.063348 1.13861 1.737188
C  0.60583 2.074674 0.859758
C  -0.517389 -1.252441 -1.247185
C  -1.321127 -2.929146 0.251243
C  0.680017 -1.192423 -0.559899
C  -0.123938 -2.881029 0.955271
C  0.859627 -2.007538 0.551631
C  2.834531 1.821142 1.687859
C  2.814174 2.477348 3.055617
C  2.837494 -0.662604 -1.382059
C  3.156611 -1.96636 -1.733567
C  3.777419 0.353106 -1.515963
C  4.433243 -2.24784 -2.201433
C  5.04346 0.055075 -1.987638
C  5.382857 -1.247534 -2.3284
H  -3.494988 -1.295439 0.819486
H  -5.133926 -1.076941 0.265708
H  -3.005587 0.035568 -1.574181
H  -4.50328 -0.7615 -1.965522
H  -4.59988 2.19827 2.960199
H  -5.741774 0.909589 2.590165
H  -4.156689 0.52245 3.24293
H  -4.8151 3.30628 -0.001574
H  -4.575718 2.209436 -1.357065
H  -5.989127 2.040375 -0.329516
H  -3.451826 -2.964664 -1.296479
H  -2.678869 -2.175663 -2.655474
H  -2.219668 2.987733 -0.749207
H  -1.679459 0.130365 2.395944
H  0.181099 3.453563 -0.72033
H  0.680314 0.601484 2.444369
H  -0.652158 -0.591479 -2.095057
H  -2.096013 -3.613252 0.573798
H  0.042255 -3.509984 1.819793
H  3.81048 1.968149 1.224174
H  2.688171 0.739246 1.758585
H  3.017415 3.544938 2.975859
H  1.858099 2.355629 3.564083
H  3.585575 2.035346 3.687179
H  2.425588 -2.760703 -1.657462
H  3.500107 1.366053 -1.254801
H  4.680996 -3.266362 -2.470191
H  5.771217 0.849556 -2.089353
H  6.374835 -1.477509 -2.692696
totalener: -1510.04618674 hartree
nucrepener: 3040.58195487 hartree
electener: -4550.62814161 hartree
oneelecener: -8110.96178337 hartree
twoeener: 3560.33364176 hartree
kineticenergy: 1503.95469642 hartree
xcener: -135.240254844257 hartree
chargesum: -0.0000000
charge: 0.423710 -0.207456 -0.307096 -0.282342 -0.251391 -0.102166 -0.073346 -0.397040 -0.406667 -0.135283 -0.090190 -0.187399 0.097985 -0.220255 -0.181252 0.319959 -0.201800 -0.169311 0.146148 -0.136937 0.215628 0.033833 -0.251636 0.299732 -0.171816 -0.262736 -0.127841 -0.087021 -0.152811 0.064312 0.087740 0.054895 0.090041 0.098030 0.090949 0.086495 0.103456 0.090581 0.098060 0.078014 0.094254 0.112174 0.093721 0.107536 0.113023 0.107745 0.117248 0.121418 0.090286 0.075487 0.088418 0.086393 0.084701 0.122652 0.143427 0.122091 0.122195 0.121457
qa: 0.4237 -0.2075 -0.3071 -0.2823 -0.2514 -0.1022 -0.0733 -0.3970 -0.4067 -0.1353 -0.0902 -0.1874 0.0980 -0.2203 -0.1813 0.3200 -0.2018 -0.1693 0.1461 -0.1369 0.2156 0.0338 -0.2516 0.2997 -0.1718 -0.2627 -0.1278 -0.0870 -0.1528 0.0643 0.0877 0.0549 0.0900 0.0980 0.0909 0.0865 0.1035 0.0906 0.0981 0.0780 0.0943 0.1122 0.0937 0.1075 0.1130 0.1077 0.1172 0.1214 0.0903 0.0755 0.0884 0.0864 0.0847 0.1227 0.1434 0.1221 0.1222 0.1215
va: 4.2006 1.0749 2.0743 2.0622 3.8251 3.8589 3.7362 3.9022 3.9122 3.8978 3.8816 3.9993 3.5995 4.0819 3.8640 3.7365 4.0118 3.9289 3.6670 3.9618 3.9558 3.8671 3.9589 3.8156 3.9626 3.9939 3.9795 3.9510 3.9782 1.0244 1.0144 1.0110 1.0087 1.0115 1.0134 1.0149 1.0095 1.0109 1.0139 1.0092 1.0063 0.9944 1.0037 1.0194 1.0093 1.0236 1.0081 1.0075 0.9923 1.0031 1.0062 1.0057 1.0094 1.0128 1.0169 1.0010 1.0017 1.0011
dispcorr: -0.036165521 hartree
energy: -1510.082352263012
dipole: -20.74899 20.46722 -0.28177 9.16266 -9.67592 -0.51326 4.56057 -4.46207 0.09850
magnitude: 0.59374 au
magnitude: 1.50918 debye
