program: Orca
programVersion: 5.0.2
elementType: Si F O O C C C C C C C C C C C C C C C C C C C C C C C C C H H H H H H H H H H H H H H H H H H H H H H H H H H H H H
charge: 0
multiplicity: 1
keywords: wb97x-d3
keywords: def2-TZVPP
keywords: def2/J RIJCOSX
keywords: DEFGRID2
keywords: scfconv7
keywords: smallprint printgap noloewdin
keywords: NOSOSCF
formula: C25H29FO2Si
InChI: InChI=1/C25H29FO2Si/c1-4-27-21-13-15-23(16-14-21)29(2,3)18-8-9-20-12-17-24(26)25(19-20)28-22-10-6-5-7-11-22/h5-7,10-17,19H,4,8-9,18H2,1-3H3
58 atoms
Si -4.173991 1.378344 0.920389
F  2.20782 -3.584752 -1.560506
O  1.756761 2.483669 0.692043
O  1.842673 -0.875937 -1.671264
C  -4.317566 -0.470448 1.370332
C  -3.112546 -1.334024 0.993466
C  -2.354279 1.833498 0.82127
C  -5.022498 2.386716 2.268632
C  -5.009978 1.740423 -0.731342
C  -2.871154 -1.427823 -0.514783
C  -1.512225 1.632814 1.922969
C  -1.754415 2.300918 -0.343605
C  -1.52884 -2.022268 -0.832822
C  -0.15346 1.859044 1.858981
C  -0.386959 2.540727 -0.433978
C  0.428056 2.309127 0.670664
C  -0.442165 -1.18788 -1.082707
C  -1.322749 -3.396486 -0.823871
C  0.813965 -1.707538 -1.339314
C  -0.064085 -3.931873 -1.060103
C  0.992779 -3.085623 -1.317696
C  2.427732 2.827612 -0.504774
C  3.907161 2.885792 -0.209319
C  2.939783 -0.842835 -0.855054
C  4.178481 -0.707136 -1.465819
C  2.833576 -0.890248 0.527604
C  5.319957 -0.631415 -0.684308
C  3.985622 -0.819027 1.29715
C  5.230996 -0.69382 0.699807
H  -4.482819 -0.543569 2.450057
H  -5.227801 -0.87435 0.912708
H  -3.232732 -2.345779 1.393167
H  -2.212153 -0.934112 1.46497
H  -4.536175 2.255583 3.236765
H  -5.002577 3.452628 2.038118
H  -6.067424 2.094415 2.388367
H  -6.069065 1.480162 -0.686379
H  -4.951139 2.799129 -0.989552
H  -4.577992 1.174401 -1.558165
H  -3.669686 -2.014842 -0.977906
H  -2.926815 -0.432745 -0.96265
H  -1.925342 1.276827 2.86132
H  -2.356632 2.480302 -1.227234
H  0.479519 1.688883 2.720571
H  0.022277 2.895889 -1.369855
H  -0.569502 -0.111509 -1.083651
H  -2.153944 -4.064516 -0.634238
H  0.098408 -5.001631 -1.058147
H  2.072987 3.797489 -0.875153
H  2.223299 2.081911 -1.281695
H  4.452703 3.148937 -1.115335
H  4.129566 3.637314 0.547948
H  4.276259 1.921545 0.136267
H  4.239238 -0.674187 -2.545928
H  1.864028 -0.973621 1.002508
H  6.285772 -0.532982 -1.162604
H  3.903544 -0.85557 2.375603
H  6.124597 -0.641409 1.306999
totalener: -1510.04845938 hartree
nucrepener: 2987.24931477 hartree
electener: -4497.29777415 hartree
oneelecener: -8003.96679467 hartree
twoeener: 3506.66902052 hartree
kineticenergy: 1503.95168339 hartree
xcener: -135.237368401128 hartree
chargesum: -0.0000000
charge: 0.433135 -0.198694 -0.274735 -0.306198 -0.282239 -0.120605 -0.088771 -0.406028 -0.405761 -0.093001 -0.108605 -0.148993 0.008582 -0.244499 -0.208245 0.314063 -0.162305 -0.130091 0.063724 -0.179476 0.297454 0.006344 -0.253954 0.206033 -0.191248 -0.084612 -0.102908 -0.138632 -0.126324 0.096607 0.078370 0.087639 0.082808 0.088428 0.094927 0.091624 0.100015 0.100196 0.096122 0.093588 0.052702 0.113006 0.120972 0.114237 0.108763 0.122678 0.113078 0.119612 0.103323 0.090386 0.080247 0.090941 0.079708 0.120778 0.122898 0.120826 0.119934 0.122177
qa: 0.4331 -0.1987 -0.2747 -0.3062 -0.2822 -0.1206 -0.0888 -0.4060 -0.4058 -0.0930 -0.1086 -0.1490 0.0086 -0.2445 -0.2082 0.3141 -0.1623 -0.1301 0.0637 -0.1795 0.2975 0.0063 -0.2540 0.2060 -0.1912 -0.0846 -0.1029 -0.1386 -0.1263 0.0966 0.0784 0.0876 0.0828 0.0884 0.0949 0.0916 0.1000 0.1002 0.0961 0.0936 0.0527 0.1130 0.1210 0.1142 0.1088 0.1227 0.1131 0.1196 0.1033 0.0904 0.0802 0.0909 0.0797 0.1208 0.1229 0.1208 0.1199 0.1222
va: 4.1373 1.0956 2.1041 2.0536 3.8520 3.8461 3.7226 3.9020 3.8982 3.7962 3.8911 3.9061 3.7501 4.0367 3.8799 3.8027 3.8885 3.9293 3.9191 3.9839 3.9751 3.8375 3.9761 3.6919 4.0125 3.8605 3.9239 3.9731 3.9068 1.0079 1.0146 1.0113 1.0153 1.0159 1.0145 1.0127 1.0159 1.0099 1.0116 1.0098 1.0333 0.9930 0.9959 1.0181 1.0201 1.0160 1.0073 1.0086 0.9903 0.9817 1.0085 1.0105 1.0050 1.0160 1.0077 1.0012 1.0032 1.0014
dispcorr: -0.035197760 hartree
energy: -1510.083657138496
dipole: -20.37544 20.05762 -0.31781 18.28009 -18.09829 0.18180 8.83285 -8.72563 0.10722
magnitude: 0.38151 au
magnitude: 0.96973 debye
