program: Orca
programVersion: 5.0.2
elementType: Si F O O C C C C C C C C C C C C C C C C C C C C C C C C C H H H H H H H H H H H H H H H H H H H H H H H H H H H H H
charge: 0
multiplicity: 1
keywords: wb97x-d3
keywords: def2-TZVPP
keywords: def2/J RIJCOSX
keywords: DEFGRID2
keywords: scfconv7
keywords: smallprint printgap noloewdin
keywords: NOSOSCF
formula: C25H29FO2Si
InChI: InChI=1/C25H29FO2Si/c1-4-27-21-13-15-23(16-14-21)29(2,3)18-8-9-20-12-17-24(26)25(19-20)28-22-10-6-5-7-11-22/h5-7,10-17,19H,4,8-9,18H2,1-3H3
58 atoms
Si -3.532185 1.324214 0.879532
F  0.467478 -3.37261 -3.746377
O  2.021133 3.674102 0.553151
O  1.942591 -2.863475 -1.61526
C  -3.297228 -0.520169 0.538348
C  -2.334291 -1.207226 1.503004
C  -1.839305 2.132975 0.809721
C  -4.290937 1.578769 2.586349
C  -4.664374 2.052369 -0.439421
C  -2.104461 -2.692037 1.195877
C  -1.29256 2.833083 1.879211
C  -1.040741 2.003613 -0.333219
C  -1.427773 -2.911554 -0.127383
C  -0.012656 3.375178 1.838019
C  0.230692 2.535038 -0.40105
C  0.761081 3.219528 0.694043
C  -0.046527 -2.765073 -0.232152
C  -2.154651 -3.223931 -1.269587
C  0.598412 -2.919159 -1.449512
C  -1.52205 -3.382081 -2.494893
C  -0.157177 -3.223096 -2.576786
C  2.642418 4.334999 1.635721
C  4.055394 4.675959 1.223826
C  2.706567 -2.001291 -0.883451
C  3.933552 -2.475251 -0.441847
C  2.3266 -0.687428 -0.639206
C  4.789139 -1.625232 0.240886
C  3.190547 0.150877 0.048493
C  4.421992 -0.311285 0.490462
H  -4.274003 -1.017685 0.566527
H  -2.939698 -0.636487 -0.490644
H  -2.712756 -1.124903 2.526327
H  -1.369633 -0.690745 1.494913
H  -4.453105 2.634592 2.808823
H  -5.262539 1.08558 2.649751
H  -3.667726 1.165704 3.381211
H  -4.240514 1.940099 -1.438625
H  -5.638581 1.560007 -0.443104
H  -4.834056 3.117402 -0.277057
H  -1.499721 -3.132283 1.993231
H  -3.063554 -3.216723 1.211609
H  -1.867361 2.966318 2.788389
H  -1.415433 1.467977 -1.199339
H  0.360354 3.905002 2.703888
H  0.830963 2.427243 -1.296173
H  0.536647 -2.534621 0.651934
H  -3.228001 -3.34921 -1.206169
H  -2.084121 -3.625446 -3.386754
H  2.650894 3.692053 2.52431
H  2.090232 5.245898 1.896681
H  4.067631 5.336932 0.358013
H  4.567747 5.1819 2.041704
H  4.621644 3.778161 0.976544
H  4.212103 -3.501163 -0.644737
H  1.369405 -0.313961 -0.981015
H  5.747025 -1.996768 0.580711
H  2.899517 1.177456 0.226461
H  5.091996 0.350253 1.022975
totalener: -1510.05101336 hartree
nucrepener: 2882.59538874 hartree
electener: -4392.64640210 hartree
oneelecener: -7794.39792717 hartree
twoeener: 3401.75152507 hartree
kineticenergy: 1503.95665059 hartree
xcener: -135.236147204419 hartree
chargesum: 0.0000000
charge: 0.440594 -0.193446 -0.296521 -0.290494 -0.258629 -0.108303 -0.142668 -0.425716 -0.378906 -0.133700 -0.107391 -0.050933 0.088972 -0.212661 -0.307089 0.348874 -0.203181 -0.216203 0.182169 -0.121907 0.163492 0.026400 -0.252626 0.276626 -0.229186 -0.205290 -0.063664 -0.028083 -0.205280 0.076012 0.079971 0.077524 0.081537 0.099525 0.100975 0.094134 0.090814 0.091251 0.095575 0.091549 0.078216 0.112032 0.106585 0.103904 0.130680 0.123342 0.113727 0.121353 0.083216 0.092444 0.088886 0.080120 0.082369 0.124184 0.116927 0.122879 0.128438 0.116581
qa: 0.4406 -0.1934 -0.2965 -0.2905 -0.2586 -0.1083 -0.1427 -0.4257 -0.3789 -0.1337 -0.1074 -0.0509 0.0890 -0.2127 -0.3071 0.3489 -0.2032 -0.2162 0.1822 -0.1219 0.1635 0.0264 -0.2526 0.2766 -0.2292 -0.2053 -0.0637 -0.0281 -0.2053 0.0760 0.0800 0.0775 0.0815 0.0995 0.1010 0.0941 0.0908 0.0913 0.0956 0.0915 0.0782 0.1120 0.1066 0.1039 0.1307 0.1233 0.1137 0.1214 0.0832 0.0924 0.0889 0.0801 0.0824 0.1242 0.1169 0.1229 0.1284 0.1166
va: 4.1929 1.1032 2.1034 2.1199 3.8359 3.8328 3.8240 3.9176 3.8986 3.8888 3.9702 3.8508 3.6225 3.9612 4.0355 3.7752 3.9350 3.9251 3.7512 3.8984 4.1018 3.8439 3.9866 3.8200 4.0506 3.9795 3.9135 3.8531 4.0319 1.0183 1.0175 1.0102 1.0089 1.0110 1.0126 1.0092 1.0138 1.0118 1.0122 1.0087 1.0108 0.9976 0.9981 1.0195 1.0110 1.0111 1.0093 1.0063 0.9860 0.9863 1.0063 1.0073 1.0047 1.0144 1.0177 0.9988 0.9936 1.0045
dispcorr: -0.030531604 hartree
energy: -1510.081544961962
dipole: -12.91872 12.72443 -0.19430 23.88867 -23.08928 0.79938 23.23954 -21.92352 1.31602
magnitude: 1.55199 au
magnitude: 3.94484 debye
