program: Orca
programVersion: 5.0.2
elementType: Si F O O C C C C C C C C C C C C C C C C C C C C C C C C C H H H H H H H H H H H H H H H H H H H H H H H H H H H H H
charge: 0
multiplicity: 1
keywords: wb97x-d3
keywords: def2-TZVPP
keywords: def2/J RIJCOSX
keywords: DEFGRID2
keywords: scfconv7
keywords: smallprint printgap noloewdin
keywords: NOSOSCF
formula: C25H29FO2Si
InChI: InChI=1/C25H29FO2Si/c1-4-27-21-13-15-23(16-14-21)29(2,3)18-8-9-20-12-17-24(26)25(19-20)28-22-10-6-5-7-11-22/h5-7,10-17,19H,4,8-9,18H2,1-3H3
58 atoms
Si -3.537976 1.237359 0.861869
F  0.997399 -4.863172 0.867984
O  1.806978 4.015828 0.398105
O  1.650334 -2.299138 0.520387
C  -3.357623 -0.40321 -0.063271
C  -2.768434 -0.258964 -1.465501
C  -1.875475 2.108802 0.789371
C  -4.03553 0.888669 2.645669
C  -4.847976 2.308474 0.030702
C  -2.448164 -1.592702 -2.145035
C  -0.690561 1.393841 0.95395
C  -1.751066 3.473531 0.514021
C  -1.514386 -2.472958 -1.355416
C  0.560165 1.984025 0.832022
C  -0.519085 4.088555 0.40203
C  0.651303 3.345075 0.549651
C  -0.324893 -1.967579 -0.834675
C  -1.829719 -3.80332 -1.106956
C  0.526206 -2.766508 -0.085715
C  -0.986205 -4.615552 -0.363703
C  0.185433 -4.094921 0.139894
C  3.019085 3.291081 0.420161
C  4.149932 4.250622 0.133434
C  2.560197 -1.538807 -0.146734
C  3.393224 -0.756395 0.645485
C  2.716183 -1.550092 -1.527274
C  4.384702 0.008198 0.053792
C  3.70436 -0.765809 -2.105028
C  4.541706 0.016555 -1.325245
H  -2.725085 -1.063979 0.539509
H  -4.330789 -0.904084 -0.111563
H  -1.863763 0.353732 -1.427441
H  -3.460908 0.293334 -2.106948
H  -4.162927 1.81297 3.210877
H  -4.97471 0.335565 2.702879
H  -3.275376 0.297891 3.159278
H  -4.585945 2.540787 -1.002633
H  -5.812433 1.79797 0.016437
H  -4.997285 3.255593 0.551744
H  -3.377221 -2.139525 -2.325589
H  -2.016842 -1.394554 -3.131485
H  -0.723437 0.33124 1.173145
H  -2.637924 4.080128 0.371196
H  1.44315 1.369433 0.948364
H  -0.445543 5.146385 0.184086
H  -0.059163 -0.929083 -0.99759
H  -2.754213 -4.214763 -1.491422
H  -1.235452 -5.650256 -0.169795
H  3.001651 2.489752 -0.327381
H  3.165136 2.815563 1.398157
H  4.036353 4.71443 -0.845812
H  4.203818 5.039668 0.882776
H  5.098517 3.713412 0.142306
H  3.268454 -0.769355 1.720584
H  2.084941 -2.167068 -2.152708
H  5.038009 0.603891 0.678548
H  3.821605 -0.777636 -3.18063
H  5.313035 0.618738 -1.785769
totalener: -1510.04925404 hartree
nucrepener: 2918.28741828 hartree
electener: -4428.33667232 hartree
oneelecener: -7865.55490540 hartree
twoeener: 3437.21823308 hartree
kineticenergy: 1503.94713746 hartree
xcener: -135.238728867825 hartree
chargesum: 0.0000000
charge: 0.432900 -0.191496 -0.286131 -0.292483 -0.268377 -0.119724 -0.095103 -0.375478 -0.420754 -0.129108 -0.210607 -0.060942 0.037214 -0.159460 -0.235899 0.292836 -0.304663 -0.127891 0.272322 -0.148711 0.167363 0.059495 -0.250012 0.277270 -0.216540 -0.165210 -0.155087 -0.118121 -0.128213 0.086590 0.081249 0.083364 0.085908 0.093456 0.089825 0.093689 0.101428 0.098475 0.093370 0.070565 0.092854 0.122221 0.105610 0.099743 0.111061 0.135409 0.105461 0.121249 0.071963 0.075464 0.086913 0.089338 0.071362 0.135069 0.133467 0.129890 0.127981 0.127640
qa: 0.4329 -0.1915 -0.2861 -0.2925 -0.2684 -0.1197 -0.0951 -0.3755 -0.4208 -0.1291 -0.2106 -0.0609 0.0372 -0.1595 -0.2359 0.2928 -0.3047 -0.1279 0.2723 -0.1487 0.1674 0.0595 -0.2500 0.2773 -0.2165 -0.1652 -0.1551 -0.1181 -0.1282 0.0866 0.0812 0.0834 0.0859 0.0935 0.0898 0.0937 0.1014 0.0985 0.0934 0.0706 0.0929 0.1222 0.1056 0.0997 0.1111 0.1354 0.1055 0.1212 0.0720 0.0755 0.0869 0.0893 0.0714 0.1351 0.1335 0.1299 0.1280 0.1276
va: 4.1817 1.1073 2.1337 2.1072 3.8404 3.8394 3.7570 3.8851 3.9069 3.8789 3.9557 3.9015 3.7203 3.8536 4.0772 3.8722 3.9264 3.9304 3.5877 3.9086 4.1263 3.8616 3.9735 3.7918 3.9202 3.9205 3.9012 3.9757 3.9070 1.0143 1.0194 1.0068 1.0096 1.0132 1.0116 1.0130 1.0082 1.0126 1.0127 1.0084 1.0023 0.9930 0.9961 1.0432 1.0202 0.9978 1.0101 1.0075 0.9877 0.9823 1.0062 1.0064 1.0081 1.0137 1.0031 0.9954 0.9991 0.9996
dispcorr: -0.032248569 hartree
energy: -1510.081502609227
dipole: -13.03897 13.01459 -0.02438 24.82493 -24.66079 0.16414 -3.94142 3.21232 -0.72909
magnitude: 0.74774 au
magnitude: 1.90060 debye
