program: Orca
programVersion: 5.0.2
elementType: Si F O O C C C C C C C C C C C C C C C C C C C C C C C C C H H H H H H H H H H H H H H H H H H H H H H H H H H H H H
charge: 0
multiplicity: 1
keywords: wb97x-d3
keywords: def2-TZVPP
keywords: def2/J RIJCOSX
keywords: DEFGRID2
keywords: scfconv7
keywords: smallprint printgap noloewdin
keywords: NOSOSCF
formula: C25H29FO2Si
InChI: InChI=1/C25H29FO2Si/c1-4-27-21-13-15-23(16-14-21)29(2,3)18-8-9-20-12-17-24(26)25(19-20)28-22-10-6-5-7-11-22/h5-7,10-17,19H,4,8-9,18H2,1-3H3
58 atoms
Si -3.602442 0.781943 1.396331
F  1.404536 0.447337 -3.273331
O  2.189142 2.370703 0.718246
O  2.029644 -0.543595 -0.894133
C  -3.818018 -0.686949 0.227557
C  -2.959404 -1.891682 0.632544
C  -1.816943 1.325338 1.203856
C  -3.931021 0.273171 3.18054
C  -4.768996 2.175045 0.893533
C  -2.394714 -2.674467 -0.558271
C  -0.879045 1.252464 2.236288
C  -1.352115 1.772877 -0.031344
C  -1.377789 -1.873103 -1.324416
C  0.443648 1.60881 2.049512
C  -0.032676 2.143503 -0.241978
C  0.881169 2.061974 0.805824
C  -0.133721 -1.618539 -0.752321
C  -1.660632 -1.331264 -2.571917
C  0.815053 -0.854793 -1.410547
C  -0.727582 -0.543724 -3.234139
C  0.498031 -0.316232 -2.651453
C  2.716113 2.893926 -0.486958
C  2.398238 4.365922 -0.672099
C  2.705663 -1.456047 -0.134734
C  2.786947 -2.796152 -0.492554
C  3.366568 -0.982206 0.988482
C  3.532281 -3.662683 0.291274
C  4.117591 -1.85963 1.755663
C  4.199789 -3.201957 1.416756
H  -4.86682 -0.980105 0.128747
H  -3.518296 -0.327659 -0.763595
H  -3.549159 -2.565709 1.258107
H  -2.113988 -1.578171 1.254657
H  -3.746574 1.095347 3.873918
H  -4.969429 -0.034882 3.312798
H  -3.304551 -0.564782 3.490719
H  -4.581144 2.508803 -0.128373
H  -5.813826 1.864398 0.946287
H  -4.649838 3.043597 1.542598
H  -1.933583 -3.597756 -0.19683
H  -3.209893 -2.974392 -1.221754
H  -1.180613 0.907208 3.218696
H  -2.030097 1.836472 -0.876098
H  1.15317 1.541798 2.864616
H  0.262526 2.48094 -1.225982
H  0.098665 -2.016855 0.228327
H  -2.619886 -1.520987 -3.036612
H  -0.943924 -0.116001 -4.204203
H  2.392488 2.301034 -1.34702
H  3.794468 2.756178 -0.403602
H  2.771515 4.952937 0.166591
H  2.877685 4.734527 -1.579613
H  1.328658 4.553552 -0.762567
H  2.278357 -3.160864 -1.375651
H  3.291459 0.065262 1.248321
H  3.595177 -4.706221 0.012167
H  4.636212 -1.488698 2.629908
H  4.782465 -3.883456 2.0215
totalener: -1510.04728418 hartree
nucrepener: 3047.43812328 hartree
electener: -4557.48540745 hartree
oneelecener: -8124.66110261 hartree
twoeener: 3567.17569516 hartree
kineticenergy: 1503.96087942 hartree
xcener: -135.242415442937 hartree
chargesum: 0.0000000
charge: 0.421953 -0.204525 -0.311490 -0.297372 -0.247861 -0.108587 -0.089852 -0.410021 -0.391360 -0.131403 -0.063186 -0.178882 0.098860 -0.242184 -0.180669 0.308323 -0.196677 -0.202114 0.207782 -0.114747 0.136276 0.041985 -0.246157 0.270026 -0.172874 -0.225368 -0.115483 -0.101173 -0.143550 0.087236 0.062357 0.088423 0.058971 0.100684 0.098601 0.093873 0.088109 0.090765 0.096571 0.094178 0.076671 0.111734 0.095098 0.110752 0.113742 0.121542 0.115621 0.120420 0.071762 0.094176 0.087929 0.084026 0.085374 0.129665 0.138617 0.125240 0.124904 0.123291
qa: 0.4220 -0.2045 -0.3115 -0.2974 -0.2479 -0.1086 -0.0899 -0.4100 -0.3914 -0.1314 -0.0632 -0.1789 0.0989 -0.2422 -0.1807 0.3083 -0.1967 -0.2021 0.2078 -0.1147 0.1363 0.0420 -0.2462 0.2700 -0.1729 -0.2254 -0.1155 -0.1012 -0.1436 0.0872 0.0624 0.0884 0.0590 0.1007 0.0986 0.0939 0.0881 0.0908 0.0966 0.0942 0.0767 0.1117 0.0951 0.1108 0.1137 0.1215 0.1156 0.1204 0.0718 0.0942 0.0879 0.0840 0.0854 0.1297 0.1386 0.1252 0.1249 0.1233
va: 4.1968 1.0856 2.0798 2.0707 3.8261 3.8661 3.7615 3.9139 3.9000 3.9003 3.8785 3.9945 3.6292 4.0570 3.8819 3.7457 3.8964 3.9333 3.6094 3.9139 4.0560 3.8626 3.9368 3.8151 3.9793 3.9890 3.9528 3.9575 3.9620 1.0156 1.0261 1.0087 1.0090 1.0100 1.0141 1.0100 1.0144 1.0132 1.0119 1.0053 1.0093 0.9948 1.0021 1.0177 1.0097 1.0132 1.0090 1.0069 1.0120 0.9942 1.0067 1.0103 1.0061 1.0048 1.0242 0.9998 1.0009 1.0006
dispcorr: -0.036088414 hartree
energy: -1510.083372590061
dipole: -19.86339 19.51240 -0.35098 4.74436 -5.13861 -0.39425 13.41766 -13.43130 -0.01364
magnitude: 0.52802 au
magnitude: 1.34213 debye
