program: Gaussian 09
title: 000069592
version: EM64L-G09RevD.01
frameworkgroup: C1[X(C3H6ClNO)]
method: RPBEPBE
basis: SDD
operation: Freq
keyword: #p
keyword: freq=noraman
keyword: PBEPBE/SDD
title: #p freq=noraman PBEPBE/SDD
converged: YES YES NO NO
title: Mulliken charges:
elementType: Cl O N C C C H H H H H H
charge: -0.073762 -0.423005 -0.061292 0.292165 -0.689501 -0.728481 0.288414 0.273729 0.249574 0.236384 0.260820 0.374956
chargesum: 0.00000
title: Mulliken charges with hydrogens summed into heavy atoms:
elementType: Cl O N C C C
charge: -0.073762 -0.048049 -0.061292 0.292165 -0.127358 0.018297
polarizability: 7.90833524e+01 -7.26286162e+00 4.73743224e+01 -9.34940600e-01 -5.21047548e-01 3.96128487e+01
1716.lowfreq: -17.5795 -0.0053 -0.0037 -0.0033 2.2779 14.9541 30.8043 81.1067 151.9771
frequency: 20.2833 81.0915 151.9727 265.3183 326.5600 355.8549 431.3826 523.4356 595.3683 639.3712 806.9916 880.0969 934.9082 1014.5113 1027.5514 1130.9086 1248.7740 1259.1163 1323.9470 1391.5929 1441.2264 1451.2725 1467.4474 1603.0664 2994.7553 3065.8891 3074.9382 3121.1991 3160.3508 3561.6093
redmass: 1.0335 4.7889 5.5684 3.5343 8.5507 2.3907 1.5314 2.0599 4.6910 5.2386 4.0289 2.3407 2.4060 1.5328 1.4956 1.1372 1.2240 1.6181 2.0747 1.2056 1.1136 1.0723 1.1025 6.3013 1.0369 1.0577 1.0961 1.1007 1.1101 1.0674
irintensity: 0.0331 1.3075 4.1215 0.9476 3.5456 5.3802 86.1897 84.3237 73.6244 45.4376 20.0413 34.2590 29.6200 44.0814 3.5559 26.5620 13.8303 30.8996 42.1076 38.0649 16.2111 9.7869 15.8401 6.4375 5.8258 12.1165 9.3413 9.3617 4.1131 56.9690
temp: 298.150 k
press: 1.00000 atm
elementType: 17 8 7 6 6 6 1 1 1 1 1 1
symmnumber: 1
zpe: 235370.0 jmol-1
zpe.correction: 0.089648 hartree
zpe.thermalcorrener: 0.097126 hartree
zpe.thermalcorrenthalpy: 0.098070 hartree
zpe.thermalcorrgfe: 0.056237 hartree
zpe.sumelectzpe: -707.415938 hartree
zpe.sumelectthermal: -707.408460 hartree
zpe.sumelectthermalent: -707.407515 hartree
zpe.sumelectthermalfe: -707.449349 hartree
dipole: 1.7798 0.2364 1.3371
dipole: 2.2386
quadrupole: -42.7893 -41.0182 -41.4397
quadrupole: -2.7278 -3.1429 0.5815
quadrupole: -1.0402 0.7309 0.3093 -2.7278 -3.1429 0.5815
hfenergy: -707.5055854 hartree
pointgroup: C01 [X(C3H6Cl1N1O1)]
dipole: -0.6726792 0.16462 -0.5441644 debye
dipolederiv: -0.6572053 -0.033006 -0.1026203 -0.0054127 -0.178844 -0.0189911 -0.3423299 -0.0308981 -0.3151673 -1.2718658 -0.2488733 0.1041101 0.255566 -0.0062424 0.0341923 0.3711119 0.1816257 -0.3869115 0.7817948 0.2894713 -0.1699969 -0.0185143 -0.3352239 -0.02161 -0.3792421 -0.1486607 -0.1524499 -0.090066 -0.1385649 -0.0467662 -0.2243408 0.3273583 0.0917929 0.0187429 0.1673037 -0.0610889 0.7869494 0.1034111 0.2369668 -0.020711 0.0888536 0.0030869 0.3433522 -0.0274092 0.4032599 -0.0048587 0.156517 0.0761767 0.0854859 -0.1773022 -0.100647 0.0833654 -0.114277 0.0206322 0.0537113 -0.0067114 -0.0649215 0.0488403 -0.0232141 -0.0749683 -0.037504 -0.0549791 0.0366859 -0.0369495 -0.0388805 -0.0272316 -0.0498541 0.0239456 0.1040038 -0.0477233 0.0654798 -0.0252518 0.0094751 0.066274 -0.0897875 0.0149524 0.0478561 0.0098381 -0.0884053 0.048112 0.0491911 -0.0201147 -0.1281196 0.0121456 -0.0848393 0.0226165 0.0003941 0.0154055 0.005462 0.1091595 0.0929394 -0.0140751 0.0537316 -0.0136565 0.073737 0.0386503 0.0418408 -0.0201439 -0.0475696 0.35619 -0.0074427 0.0181933 0.0124842 0.1364595 -0.0657417 0.021386 -0.0716151 0.3695105 unknown
polarizability: 77.4464421|9.4053748|47.9490856|3.7104004|3.1219052|40.6749958 unknown
InChI: InChI=1S/C3H6ClNO/c1-3(2-4)5-6/h6H,2H2,1H3
charge 0 multiplicity 1
12 atoms
Cl 2.558049 0.070193 0.636652
O  -2.237304 -0.491483 0.21057
N  -0.909862 -0.845214 -0.296483
C  -0.10748 0.20215 -0.242823
C  1.267275 -0.067569 -0.771804
C  -0.485689 1.565025 0.28199
H  1.363066 -1.087586 -1.166867
H  1.597579 0.687153 -1.500597
H  -1.323718 1.984421 -0.30479
H  0.373437 2.252601 0.24935
H  -0.843221 1.488106 1.324537
H  -2.732732 -1.346198 0.120365
