program: Orca
programVersion: 5.0.2
elementType: O O O C C C C C C C C C C C C C C C C C C C C C C H H H H H H H H H H H H H H H H H H H H H H H H H H
charge: 0
multiplicity: 1
keywords: wb97x-d3
keywords: def2-TZVPP
keywords: def2/J RIJCOSX
keywords: DEFGRID2
keywords: scfconv7
keywords: smallprint printgap noloewdin
keywords: NOSOSCF
formula: C22H26O3
InChI: InChI=1/C22H26O3/c1-15(2)10-19-20(22(19,3)4)21(23)25-14-17-12-18(24-13-17)11-16-8-6-5-7-9-16/h5-10,12-13,19-20H,11,14H2,1-4H3
51 atoms
O  2.083652 1.84206 -0.960623
O  2.577511 1.265868 1.139623
O  -1.659773 0.262424 0.746015
C  5.020964 -0.247804 0.007587
C  3.875613 -1.156549 -0.271241
C  3.805766 0.321827 -0.691817
C  5.388089 0.136792 1.4195
C  6.23405 -0.390171 -0.882935
C  2.989368 -1.697091 0.78895
C  2.796957 1.175715 -0.047395
C  1.744332 -2.127903 0.566847
C  0.903019 -2.704366 1.662409
C  1.101477 -2.083182 -0.786817
C  0.915802 2.548629 -0.506203
C  -0.209261 1.606573 -0.263093
C  -1.025339 0.968194 -1.254199
C  -0.640419 1.131284 0.928524
C  -1.884382 0.16202 -0.589714
C  -2.964921 -0.756451 -1.029333
C  -4.315178 -0.330092 -0.507955
C  -4.887029 -0.956276 0.594211
C  -4.993195 0.729091 -1.10693
C  -6.114977 -0.53401 1.089557
C  -6.219305 1.152379 -0.615554
C  -6.784059 0.521666 0.486565
H  4.001512 -1.81018 -1.130188
H  3.915973 0.496264 -1.755609
H  4.555051 0.138447 2.11592
H  6.130008 -0.567821 1.800607
H  5.841855 1.129205 1.440511
H  6.804564 0.539934 -0.917254
H  6.896162 -1.171857 -0.505658
H  5.961001 -0.651852 -1.905984
H  3.392153 -1.766327 1.794798
H  0.002127 -2.103318 1.812756
H  1.438042 -2.758334 2.610209
H  0.561186 -3.7112 1.40812
H  1.514023 -1.305651 -1.429199
H  0.025874 -1.917801 -0.705937
H  1.229152 -3.036988 -1.307715
H  0.677646 3.233721 -1.317814
H  1.140967 3.143884 0.37895
H  -0.971913 1.098457 -2.323905
H  -0.340115 1.319535 1.947334
H  -2.744534 -1.776505 -0.701668
H  -2.965519 -0.76852 -2.120259
H  -4.371085 -1.782996 1.068024
H  -4.556363 1.225214 -1.966047
H  -6.547878 -1.031173 1.948166
H  -6.73618 1.974258 -1.094027
H  -7.740383 0.850933 0.871701
elementType: O C H
totalener: -1079.73751324 hartree
nucrepener: 2166.40880579 hartree
electener: -3246.14631903 hartree
oneelecener: -5772.68054584 hartree
twoeener: 2526.53422681 hartree
cpcmener: -0.03158245 hartree
kineticenergy: 1074.86453321 hartree
xcener: -106.464471050308 hartree
chargesum: -0.0000000
charge: -0.295185 -0.493072 -0.289638 0.139587 -0.022372 -0.092819 -0.297663 -0.265373 -0.284570 0.387297 -0.002046 -0.217190 -0.299404 0.087924 -0.033540 -0.359488 -0.039142 0.192775 -0.027605 0.045479 -0.197112 -0.201430 -0.160818 -0.162737 -0.170640 0.115566 0.094682 0.089843 0.098116 0.103100 0.095385 0.095028 0.087421 0.126539 0.085563 0.089753 0.101516 0.099046 0.088913 0.123918 0.122284 0.118442 0.156841 0.170997 0.111005 0.116732 0.143258 0.144584 0.159485 0.159823 0.160940
qa: -0.2952 -0.4931 -0.2896 0.1396 -0.0224 -0.0928 -0.2977 -0.2654 -0.2846 0.3873 -0.0020 -0.2172 -0.2994 0.0879 -0.0335 -0.3595 -0.0391 0.1928 -0.0276 0.0455 -0.1971 -0.2014 -0.1608 -0.1627 -0.1706 0.1156 0.0947 0.0898 0.0981 0.1031 0.0954 0.0950 0.0874 0.1265 0.0856 0.0898 0.1015 0.0990 0.0889 0.1239 0.1223 0.1184 0.1568 0.1710 0.1110 0.1167 0.1433 0.1446 0.1595 0.1598 0.1609
va: 2.1021 1.9890 2.2436 3.7571 3.7958 3.8306 3.8882 3.8983 3.8346 4.1219 3.6646 3.9177 3.9536 3.8323 3.5449 3.9881 3.9254 3.5734 3.7822 3.5727 3.9448 3.9353 3.8925 3.8977 3.8879 1.0033 1.0313 1.0180 0.9989 0.9997 1.0024 1.0023 1.0040 1.0010 1.0030 1.0083 0.9949 1.0037 1.0002 0.9987 0.9921 1.0113 1.0112 1.0034 1.0044 1.0068 1.0042 1.0033 0.9905 0.9904 0.9895
dispcorr: -0.026757545 hartree
energy: -1079.764270789718
dipole: 15.95097 -16.02080 -0.06983 -11.17824 10.79362 -0.38462 -0.16611 -1.23550 -1.40161
magnitude: 1.45510 au
magnitude: 3.69857 debye
