program: Orca
programVersion: 5.0.2
elementType: O O O C C C C C C C C C C C C C C C C C C C C C C H H H H H H H H H H H H H H H H H H H H H H H H H H
charge: 0
multiplicity: 1
keywords: wb97x-d3
keywords: def2-TZVPP
keywords: def2/J RIJCOSX
keywords: DEFGRID2
keywords: scfconv7
keywords: smallprint printgap noloewdin
keywords: NOSOSCF
formula: C22H26O3
InChI: InChI=1/C22H26O3/c1-15(2)10-19-20(22(19,3)4)21(23)25-14-17-12-18(24-13-17)11-16-8-6-5-7-9-16/h5-10,12-13,19-20H,11,14H2,1-4H3
51 atoms
O  2.081699 2.322103 -0.732804
O  2.174866 1.154221 1.167919
O  -1.973308 2.435858 1.054303
C  3.704666 -1.000548 -0.461713
C  2.272739 -1.27213 -0.808003
C  2.826995 0.146018 -0.914956
C  4.172989 -1.12858 0.965662
C  4.749612 -1.427079 -1.466083
C  1.252599 -1.656411 0.201978
C  2.345688 1.219652 -0.026027
C  0.947801 -2.919625 0.51308
C  -0.110053 -3.239075 1.524998
C  1.618629 -4.10961 -0.099442
C  1.378044 3.385718 -0.073751
C  -0.046554 3.009571 0.118085
C  -0.974256 2.639018 -0.909015
C  -0.712791 2.858489 1.284615
C  -2.123611 2.295021 -0.284024
C  -3.407569 1.733295 -0.77257
C  -3.545485 0.272763 -0.408536
C  -4.514612 -0.15491 0.490419
C  -2.677684 -0.669028 -0.958226
C  -4.621706 -1.498332 0.830863
C  -2.782948 -2.009393 -0.622367
C  -3.756112 -2.429097 0.276936
H  2.124755 -1.723477 -1.785292
H  3.000636 0.480754 -1.931184
H  3.393063 -0.956514 1.701554
H  4.554715 -2.139104 1.127124
H  4.990652 -0.435421 1.172825
H  5.040305 -2.466979 -1.303679
H  4.390496 -1.340259 -2.492433
H  5.650139 -0.815652 -1.37766
H  0.704767 -0.867141 0.70478
H  -0.58856 -2.343391 1.920231
H  0.313642 -3.793909 2.366819
H  -0.887857 -3.878451 1.099723
H  2.034337 -4.75944 0.673327
H  2.425913 -3.849151 -0.781302
H  0.898242 -4.716539 -0.652992
H  1.477886 4.234948 -0.748902
H  1.854771 3.652096 0.870859
H  -0.798313 2.619285 -1.97338
H  -0.429266 3.011185 2.314451
H  -3.434073 1.853394 -1.857215
H  -4.252614 2.298827 -0.372111
H  -5.194925 0.566025 0.928245
H  -1.910383 -0.351061 -1.654981
H  -5.382991 -1.815121 1.532192
H  -2.103597 -2.728432 -1.062059
H  -3.838205 -3.475297 0.542169
elementType: O C H
totalener: -1079.74973682 hartree
nucrepener: 2207.33288666 hartree
electener: -3287.08262349 hartree
oneelecener: -5854.52113375 hartree
twoeener: 2567.43851026 hartree
cpcmener: -0.02614108 hartree
kineticenergy: 1074.88076159 hartree
xcener: -106.465768597511 hartree
chargesum: 0.0000000
charge: -0.289228 -0.462166 -0.276854 0.138612 -0.033305 -0.085339 -0.291957 -0.270488 -0.265695 0.368315 -0.027768 -0.247977 -0.255134 0.095945 -0.064126 -0.343605 -0.033488 0.206317 -0.058386 0.042755 -0.187963 -0.190405 -0.148384 -0.177071 -0.169169 0.113757 0.094856 0.098702 0.094452 0.104750 0.092341 0.087466 0.097175 0.122545 0.093517 0.111971 0.086587 0.096871 0.086036 0.101598 0.119649 0.114716 0.158381 0.173394 0.116168 0.105602 0.139075 0.142088 0.155407 0.161801 0.157660
qa: -0.2892 -0.4622 -0.2769 0.1386 -0.0333 -0.0853 -0.2920 -0.2705 -0.2657 0.3683 -0.0278 -0.2480 -0.2551 0.0959 -0.0641 -0.3436 -0.0335 0.2063 -0.0584 0.0428 -0.1880 -0.1904 -0.1484 -0.1771 -0.1692 0.1138 0.0949 0.0987 0.0945 0.1047 0.0923 0.0875 0.0972 0.1225 0.0935 0.1120 0.0866 0.0969 0.0860 0.1016 0.1196 0.1147 0.1584 0.1734 0.1162 0.1056 0.1391 0.1421 0.1554 0.1618 0.1577
va: 2.1108 2.0288 2.2690 3.6883 3.8107 3.9071 3.8916 3.8995 3.8247 4.1414 3.6617 3.9299 3.9403 3.8481 3.6389 3.9960 3.9535 3.6189 3.8291 3.6073 3.9509 3.9092 3.9026 3.8785 3.8834 1.0022 1.0284 1.0146 1.0000 1.0012 1.0033 1.0046 1.0024 1.0094 1.0027 0.9995 0.9946 0.9982 1.0080 0.9989 0.9903 1.0086 1.0106 0.9972 1.0061 1.0106 1.0038 1.0051 0.9908 0.9866 0.9916
dispcorr: -0.026862649 hartree
energy: -1079.776599471867
dipole: 13.01282 -12.97276 0.04006 -22.12192 21.85767 -0.26425 -1.21167 0.02941 -1.18225
magnitude: 1.21209 au
magnitude: 3.08088 debye
