program: Orca
programVersion: 5.0.2
elementType: O O O C C C C C C C C C C C C C C C C C C C C C C H H H H H H H H H H H H H H H H H H H H H H H H H H
charge: 0
multiplicity: 1
keywords: wb97x-d3
keywords: def2-TZVPP
keywords: def2/J RIJCOSX
keywords: DEFGRID2
keywords: scfconv7
keywords: smallprint printgap noloewdin
keywords: NOSOSCF
formula: C22H26O3
InChI: InChI=1/C22H26O3/c1-15(2)10-19-20(22(19,3)4)21(23)25-14-17-12-18(24-13-17)11-16-8-6-5-7-9-16/h5-10,12-13,19-20H,11,14H2,1-4H3
51 atoms
O  2.003964 1.271401 0.074214
O  3.995901 2.05462 -0.54333
O  -2.165443 2.216905 -0.568067
C  3.583827 -1.253989 0.902034
C  2.852039 -1.50474 -0.372657
C  3.750991 -0.274335 -0.249799
C  2.839335 -0.863819 2.155292
C  4.800683 -2.102084 1.190647
C  1.371067 -1.443067 -0.466129
C  3.2780 1.12317 -0.250238
C  0.676545 -1.262972 -1.591211
C  -0.8217 -1.237004 -1.584622
C  1.317969 -1.015133 -2.921096
C  1.421589 2.581879 0.011834
C  -0.047595 2.384119 0.064658
C  -0.826481 1.897796 1.163915
C  -0.918903 2.555341 -0.955593
C  -2.103343 1.813716 0.722662
C  -3.355986 1.303397 1.33934
C  -3.653438 -0.10438 0.878741
C  -3.197143 -1.19457 1.614302
C  -4.334618 -0.336822 -0.312665
C  -3.418268 -2.491455 1.171746
C  -4.554558 -1.632975 -0.759471
C  -4.096548 -2.714515 -0.018844
H  3.305189 -2.25691 -1.01386
H  4.704789 -0.351777 -0.759492
H  3.48225 -0.276943 2.814286
H  1.936031 -0.286604 1.977861
H  2.546514 -1.762424 2.702501
H  5.508458 -1.569379 1.829149
H  4.515211 -3.020626 1.70799
H  5.325661 -2.3868 0.277804
H  0.816587 -1.579732 0.458055
H  -1.197885 -0.29734 -1.99849
H  -1.229548 -1.353758 -0.580608
H  -1.234593 -2.033161 -2.210392
H  0.851475 -1.61915 -3.703513
H  2.387269 -1.223151 -2.930771
H  1.183948 0.030154 -3.217949
H  1.707518 3.086187 -0.912936
H  1.781463 3.181269 0.851159
H  -0.473693 1.641096 2.150892
H  -0.798168 2.903879 -1.969895
H  -4.191259 1.965833 1.098345
H  -3.235193 1.32427 2.423031
H  -2.663023 -1.027781 2.54269
H  -4.700412 0.499774 -0.896551
H  -3.060159 -3.328332 1.758007
H  -5.086737 -1.798054 -1.687844
H  -4.269804 -3.725003 -0.366364
elementType: O C H
totalener: -1079.74859373 hartree
nucrepener: 2234.17988784 hartree
electener: -3313.92848157 hartree
oneelecener: -5907.43672989 hartree
twoeener: 2593.50824832 hartree
cpcmener: -0.02771683 hartree
kineticenergy: 1074.86720124 hartree
xcener: -106.463556534226 hartree
chargesum: 0.0000000
charge: -0.252302 -0.482104 -0.275410 0.134727 -0.019824 -0.150305 -0.287696 -0.267978 -0.208445 0.425708 -0.060175 -0.211671 -0.265142 0.071586 -0.057644 -0.337833 -0.046796 0.210761 -0.063959 0.066874 -0.204945 -0.214230 -0.127472 -0.133162 -0.195567 0.110834 0.091391 0.102328 0.081003 0.100383 0.095930 0.093127 0.086815 0.119446 0.091101 0.051738 0.112304 0.102680 0.093018 0.096988 0.105370 0.119229 0.159642 0.173586 0.115315 0.107729 0.136752 0.137657 0.156668 0.155482 0.156487
qa: -0.2523 -0.4821 -0.2754 0.1347 -0.0198 -0.1503 -0.2877 -0.2680 -0.2084 0.4257 -0.0602 -0.2117 -0.2651 0.0716 -0.0576 -0.3378 -0.0468 0.2108 -0.0640 0.0669 -0.2049 -0.2142 -0.1275 -0.1332 -0.1956 0.1108 0.0914 0.1023 0.0810 0.1004 0.0959 0.0931 0.0868 0.1194 0.0911 0.0517 0.1123 0.1027 0.0930 0.0970 0.1054 0.1192 0.1596 0.1736 0.1153 0.1077 0.1368 0.1377 0.1567 0.1555 0.1565
va: 2.1043 2.0253 2.2641 3.7470 3.7892 3.8998 3.9133 3.9043 3.7815 4.1077 3.7895 3.9291 3.9463 3.8596 3.7027 3.9743 3.9084 3.5980 3.8233 3.5565 3.9196 3.9394 3.8546 3.8614 3.9026 1.0046 1.0297 1.0012 1.0083 0.9988 1.0020 1.0020 1.0051 0.9964 0.9944 1.0168 0.9998 1.0003 1.0050 0.9973 1.0087 0.9911 1.0072 0.9954 1.0093 1.0112 1.0059 1.0113 0.9903 0.9913 0.9920
dispcorr: -0.029171066 hartree
energy: -1079.777764791345
dipole: 7.18892 -8.21188 -1.02295 -14.52485 13.71102 -0.81383 -0.02307 0.51765 0.49458
magnitude: 1.39763 au
magnitude: 3.55249 debye
