program: Orca
programVersion: 5.0.2
elementType: O O O C C C C C C C C C C C C C C C C C C C C C C H H H H H H H H H H H H H H H H H H H H H H H H H H
charge: 0
multiplicity: 1
keywords: wb97x-d3
keywords: def2-TZVPP
keywords: def2/J RIJCOSX
keywords: DEFGRID2
keywords: scfconv7
keywords: smallprint printgap noloewdin
keywords: NOSOSCF
formula: C22H26O3
InChI: InChI=1/C22H26O3/c1-15(2)10-19-20(22(19,3)4)21(23)25-14-17-12-18(24-13-17)11-16-8-6-5-7-9-16/h5-10,12-13,19-20H,11,14H2,1-4H3
51 atoms
O  2.321389 1.363036 0.262927
O  2.178502 1.604109 -1.950687
O  -1.911527 2.023103 1.373668
C  4.17533 -1.007116 -0.181244
C  2.795985 -1.564791 -0.24353
C  3.17094 -0.358493 -1.115961
C  4.678171 -0.321962 1.065753
C  5.264659 -1.782069 -0.888284
C  1.840416 -1.478723 0.88645
C  2.51967 0.957552 -0.983509
C  0.517122 -1.583903 0.744115
C  -0.403917 -1.559849 1.923302
C  -0.124511 -1.721805 -0.607983
C  1.587672 2.577009 0.489652
C  0.122285 2.326202 0.539923
C  -0.79632 2.091363 -0.536738
C  -0.620555 2.266028 1.670298
C  -2.014941 1.913805 0.027412
C  -3.359592 1.604581 -0.530481
C  -3.686465 0.129949 -0.468325
C  -3.676964 -0.64398 -1.62464
C  -3.972737 -0.488207 0.747218
C  -3.939674 -2.006998 -1.570808
C  -4.228349 -1.851015 0.805158
C  -4.21006 -2.616307 -0.354024
H  2.684656 -2.463937 -0.845881
H  3.318397 -0.597013 -2.163058
H  5.15625 -1.060183 1.713378
H  5.432001 0.426747 0.815269
H  3.907104 0.168569 1.652031
H  4.89395 -2.286768 -1.781522
H  6.081044 -1.124017 -1.19331
H  5.682884 -2.544956 -0.228063
H  2.252571 -1.366734 1.884693
H  0.135909 -1.47094 2.866373
H  -1.010362 -2.469061 1.965645
H  -1.108586 -0.726961 1.857454
H  0.1664 -0.912793 -1.282038
H  -1.212178 -1.714077 -0.540663
H  0.162052 -2.655809 -1.098761
H  1.846342 3.326516 -0.258663
H  1.937271 2.937474 1.45622
H  -0.577961 2.063575 -1.592309
H  -0.370932 2.390274 2.713052
H  -3.385288 1.942016 -1.567081
H  -4.118807 2.179968 0.006443
H  -3.459618 -0.177186 -2.578388
H  -3.998232 0.0971 1.658906
H  -3.928279 -2.593012 -2.481189
H  -4.445577 -2.316137 1.758615
H  -4.409511 -3.679358 -0.308259
elementType: O C H
totalener: -1079.74702831 hartree
nucrepener: 2253.02656517 hartree
electener: -3332.77359348 hartree
oneelecener: -5945.50381521 hartree
twoeener: 2612.73022174 hartree
cpcmener: -0.02495939 hartree
kineticenergy: 1074.85052874 hartree
xcener: -106.462502518486 hartree
chargesum: -0.0000000
charge: -0.258523 -0.484483 -0.276493 0.142981 -0.036987 -0.141352 -0.291139 -0.267901 -0.229890 0.417526 -0.022005 -0.241109 -0.232237 0.050367 -0.024369 -0.349932 -0.056237 0.233319 -0.055889 0.067813 -0.203346 -0.226969 -0.137881 -0.159590 -0.155292 0.110914 0.090736 0.097607 0.101356 0.090068 0.086769 0.095940 0.093209 0.121932 0.099673 0.107882 0.078148 0.095477 0.031391 0.115951 0.121508 0.108826 0.158028 0.171506 0.101806 0.116342 0.136904 0.139521 0.154499 0.156805 0.156818
qa: -0.2585 -0.4845 -0.2765 0.1430 -0.0370 -0.1414 -0.2911 -0.2679 -0.2299 0.4175 -0.0220 -0.2411 -0.2322 0.0504 -0.0244 -0.3499 -0.0562 0.2333 -0.0559 0.0678 -0.2033 -0.2270 -0.1379 -0.1596 -0.1553 0.1109 0.0907 0.0976 0.1014 0.0901 0.0868 0.0959 0.0932 0.1219 0.0997 0.1079 0.0781 0.0955 0.0314 0.1160 0.1215 0.1088 0.1580 0.1715 0.1018 0.1163 0.1369 0.1395 0.1545 0.1568 0.1568
va: 2.1102 2.0148 2.2656 3.7432 3.7966 3.8676 3.8972 3.9006 3.7931 4.1146 3.6718 3.9058 3.9496 3.8589 3.5740 3.9660 3.9327 3.5934 3.8050 3.5613 3.9107 3.8930 3.8604 3.8672 3.8682 1.0037 1.0314 0.9986 1.0011 1.0133 1.0055 1.0021 1.0024 1.0015 1.0126 0.9968 0.9933 1.0045 1.0302 1.0044 1.0077 1.0013 1.0217 0.9958 1.0126 1.0080 1.0054 1.0158 0.9918 0.9915 0.9899
dispcorr: -0.030510823 hartree
energy: -1079.777539129976
dipole: 10.89683 -10.93842 -0.04159 -13.90958 13.39796 -0.51162 2.63900 -1.77585 0.86316
magnitude: 1.00425 au
magnitude: 2.55261 debye
