program: Orca
programVersion: 5.0.2
elementType: O O O C C C C C C C C C C C C C C C C C C C C C C H H H H H H H H H H H H H H H H H H H H H H H H H H
charge: 0
multiplicity: 1
keywords: wb97x-d3
keywords: def2-TZVPP
keywords: def2/J RIJCOSX
keywords: DEFGRID2
keywords: scfconv7
keywords: smallprint printgap noloewdin
keywords: NOSOSCF
formula: C22H26O3
InChI: InChI=1/C22H26O3/c1-15(2)10-19-20(22(19,3)4)21(23)25-14-17-12-18(24-13-17)11-16-8-6-5-7-9-16/h5-10,12-13,19-20H,11,14H2,1-4H3
51 atoms
O  1.65701 1.231057 -1.493144
O  2.800579 1.53934 0.400843
O  -1.384781 1.710065 1.602773
C  4.404939 -1.000721 -0.331692
C  3.140724 -1.508643 0.268575
C  3.090721 -0.471922 -0.867782
C  5.349815 -0.132342 0.462838
C  5.129501 -1.929842 -1.279264
C  2.702337 -1.164709 1.64093
C  2.542407 0.859118 -0.56392
C  1.430569 -1.230837 2.042956
C  1.027813 -0.886164 3.442274
C  0.323475 -1.625228 1.104972
C  0.85307 2.389963 -1.215273
C  -0.240246 2.047243 -0.265803
C  -1.467591 1.376316 -0.581334
C  -0.249223 2.21469 1.077222
C  -2.123271 1.197157 0.589278
C  -3.430576 0.586494 0.95554
C  -4.044373 -0.157976 -0.198764
C  -3.52064 -1.384402 -0.60435
C  -5.133596 0.364625 -0.887169
C  -4.076294 -2.072538 -1.6724
C  -5.69463 -0.323311 -1.956525
C  -5.167137 -1.543616 -2.352197
H  2.82247 -2.490465 -0.074542
H  2.788719 -0.865778 -1.831364
H  5.915829 0.52433 -0.200924
H  4.865059 0.492676 1.206984
H  6.070604 -0.766339 0.984267
H  5.7371 -1.367969 -1.991761
H  5.797013 -2.595877 -0.728279
H  4.439072 -2.552637 -1.849954
H  3.461019 -0.858001 2.354261
H  1.877136 -0.582967 4.054689
H  0.540673 -1.732909 3.933727
H  0.299734 -0.06994 3.444521
H  0.231704 -0.924956 0.271144
H  -0.640646 -1.659004 1.612769
H  0.493039 -2.610871 0.664512
H  0.448357 2.682946 -2.182797
H  1.467363 3.212274 -0.847077
H  -1.803896 1.072872 -1.560618
H  0.448601 2.658562 1.770054
H  -4.117959 1.363978 1.303459
H  -3.286769 -0.091731 1.802717
H  -2.670891 -1.805287 -0.077893
H  -5.552018 1.317201 -0.583535
H  -3.659349 -3.025419 -1.973394
H  -6.545729 0.095918 -2.478343
H  -5.603078 -2.082336 -3.183951
elementType: O C H
totalener: -1079.74918832 hartree
nucrepener: 2197.85412276 hartree
electener: -3277.60331108 hartree
oneelecener: -5835.08216478 hartree
twoeener: 2557.47885370 hartree
cpcmener: -0.02405039 hartree
kineticenergy: 1074.85107604 hartree
xcener: -106.461439873037 hartree
chargesum: 0.0000000
charge: -0.291851 -0.464225 -0.280404 0.133891 -0.026381 -0.091199 -0.296645 -0.265679 -0.252307 0.373043 -0.006439 -0.219390 -0.296918 0.083018 -0.068231 -0.307288 -0.027007 0.176097 -0.025021 0.005480 -0.199542 -0.170876 -0.165606 -0.158358 -0.162579 0.110182 0.089699 0.099534 0.094396 0.097228 0.095234 0.094222 0.085521 0.120436 0.087297 0.100341 0.088742 0.084071 0.101292 0.115895 0.118545 0.117083 0.154448 0.168293 0.103461 0.115412 0.156438 0.137969 0.155060 0.156188 0.157431
qa: -0.2919 -0.4642 -0.2804 0.1339 -0.0264 -0.0912 -0.2966 -0.2657 -0.2523 0.3730 -0.0064 -0.2194 -0.2969 0.0830 -0.0682 -0.3073 -0.0270 0.1761 -0.0250 0.0055 -0.1995 -0.1709 -0.1656 -0.1584 -0.1626 0.1102 0.0897 0.0995 0.0944 0.0972 0.0952 0.0942 0.0855 0.1204 0.0873 0.1003 0.0887 0.0841 0.1013 0.1159 0.1185 0.1171 0.1544 0.1683 0.1035 0.1154 0.1564 0.1380 0.1551 0.1562 0.1574
va: 2.1028 2.0210 2.2539 3.7634 3.8129 3.8303 3.8877 3.8978 3.8106 4.1395 3.6777 3.9103 3.9580 3.8399 3.6243 3.9450 3.9190 3.6123 3.8045 3.6170 3.9150 3.9335 3.9284 3.9001 3.8945 1.0056 1.0324 1.0004 1.0186 0.9989 1.0026 1.0024 1.0046 1.0006 1.0088 0.9948 1.0007 0.9981 1.0026 1.0014 0.9930 1.0117 1.0063 1.0062 1.0096 1.0032 0.9926 1.0045 0.9932 0.9912 0.9904
dispcorr: -0.027789605 hartree
energy: -1079.776977929064
dipole: 12.92646 -13.58030 -0.65384 -12.25396 11.54688 -0.70708 3.77348 -4.47252 -0.69905
magnitude: 1.19001 au
magnitude: 3.02478 debye
