program: Orca
programVersion: 5.0.2
elementType: O O O C C C C C C C C C C C C C C C C C C C C C C H H H H H H H H H H H H H H H H H H H H H H H H H H
charge: 0
multiplicity: 1
keywords: wb97x-d3
keywords: def2-TZVPP
keywords: def2/J RIJCOSX
keywords: DEFGRID2
keywords: scfconv7
keywords: smallprint printgap noloewdin
keywords: NOSOSCF
formula: C22H26O3
InChI: InChI=1/C22H26O3/c1-15(2)10-19-20(22(19,3)4)21(23)25-14-17-12-18(24-13-17)11-16-8-6-5-7-9-16/h5-10,12-13,19-20H,11,14H2,1-4H3
51 atoms
O  1.909418 1.867007 0.595639
O  1.324748 0.517219 -1.082996
O  -2.301236 2.460706 1.243355
C  2.079976 -1.725798 0.95704
C  3.262889 -1.540383 0.07209
C  2.632704 -0.323418 0.741921
C  0.739589 -2.118637 0.386093
C  2.317753 -2.298957 2.334255
C  3.212016 -1.776693 -1.393213
C  1.891977 0.68758 -0.03032
C  3.968252 -1.150739 -2.297171
C  3.874544 -1.477652 -3.756029
C  4.928419 -0.055954 -1.947381
C  1.12039 2.931832 0.039855
C  -0.336206 2.692717 0.237439
C  -1.284462 2.171579 -0.70037
C  -1.020865 2.852294 1.395178
C  -2.457003 2.046104 -0.037555
C  -3.763602 1.449237 -0.411815
C  -3.912462 0.054136 0.154674
C  -4.886024 -0.238944 1.102179
C  -3.049685 -0.960432 -0.256688
C  -4.99979 -1.520883 1.628602
C  -3.159356 -2.239198 0.267091
C  -4.136261 -2.523776 1.214175
H  4.215922 -1.794797 0.530633
H  3.18426 0.083298 1.58174
H  0.577483 -1.784989 -0.635304
H  0.644511 -3.206725 0.393189
H  -0.068499 -1.717062 1.000873
H  2.296502 -3.390507 2.303524
H  3.28428 -1.998125 2.740804
H  1.545943 -1.973427 3.034575
H  2.523397 -2.542219 -1.73979
H  3.598282 -0.593841 -4.337771
H  3.137857 -2.255505 -3.95791
H  4.837591 -1.815532 -4.148264
H  5.087475 0.05233 -0.87597
H  4.56861 0.904475 -2.327644
H  5.902047 -0.224658 -2.414013
H  1.359343 3.078195 -1.014691
H  1.448548 3.817723 0.581941
H  -1.107155 1.913361 -1.732259
H  -0.734843 3.221128 2.368606
H  -3.818274 1.416874 -1.501908
H  -4.58856 2.080644 -0.073249
H  -5.562813 0.53984 1.433883
H  -2.280347 -0.74713 -0.990333
H  -5.764061 -1.732722 2.365671
H  -2.480942 -3.015702 -0.06428
H  -4.222211 -3.521854 1.624495
elementType: O C H
totalener: -1079.74870750 hartree
nucrepener: 2182.35083799 hartree
electener: -3262.09954549 hartree
oneelecener: -5804.69787312 hartree
twoeener: 2542.59832763 hartree
cpcmener: -0.02539776 hartree
kineticenergy: 1074.87116930 hartree
xcener: -106.463222354258 hartree
chargesum: 0.0000000
charge: -0.291092 -0.465966 -0.274882 0.148579 -0.025728 -0.108828 -0.329128 -0.265213 -0.255395 0.402706 -0.028042 -0.225340 -0.268226 0.076348 -0.076783 -0.306371 -0.044076 0.204038 -0.060527 0.033442 -0.189919 -0.195176 -0.149553 -0.169734 -0.169861 0.113295 0.093685 0.099756 0.102671 0.104481 0.093695 0.086292 0.095427 0.120356 0.093289 0.088176 0.094511 0.093811 0.099250 0.103607 0.117136 0.121568 0.156949 0.173380 0.116539 0.104253 0.139102 0.146229 0.155722 0.164553 0.156995
qa: -0.2911 -0.4660 -0.2749 0.1486 -0.0257 -0.1088 -0.3291 -0.2652 -0.2554 0.4027 -0.0280 -0.2253 -0.2682 0.0763 -0.0768 -0.3064 -0.0441 0.2040 -0.0605 0.0334 -0.1899 -0.1952 -0.1496 -0.1697 -0.1699 0.1133 0.0937 0.0998 0.1027 0.1045 0.0937 0.0863 0.0954 0.1204 0.0933 0.0882 0.0945 0.0938 0.0992 0.1036 0.1171 0.1216 0.1569 0.1734 0.1165 0.1043 0.1391 0.1462 0.1557 0.1646 0.1570
va: 2.1180 2.0202 2.2740 3.7421 3.8476 3.8227 3.9063 3.8993 3.8458 4.0938 3.7170 3.9281 3.9444 3.8578 3.6194 3.9801 3.9707 3.6227 3.8313 3.6281 3.9479 3.9160 3.8950 3.8927 3.9066 1.0044 1.0303 1.0090 0.9995 0.9948 1.0021 1.0051 1.0023 0.9999 0.9959 1.0072 0.9969 1.0048 0.9977 1.0003 1.0046 0.9951 1.0170 0.9949 1.0053 1.0128 1.0038 1.0020 0.9909 0.9859 0.9908
dispcorr: -0.025644502 hartree
energy: -1079.774351998507
dipole: 16.73544 -16.28679 0.44865 -14.29173 14.43909 0.14737 -5.66756 6.12519 0.45763
magnitude: 0.65760 au
magnitude: 1.67147 debye
