program: Orca
programVersion: 5.0.2
elementType: O O O C C C C C C C C C C C C C C C C C C C C C C H H H H H H H H H H H H H H H H H H H H H H H H H H
charge: 0
multiplicity: 1
keywords: wb97x-d3
keywords: def2-TZVPP
keywords: def2/J RIJCOSX
keywords: DEFGRID2
keywords: scfconv7
keywords: smallprint printgap noloewdin
keywords: NOSOSCF
formula: C22H26O3
InChI: InChI=1/C22H26O3/c1-15(2)10-19-20(22(19,3)4)21(23)25-14-17-12-18(24-13-17)11-16-8-6-5-7-9-16/h5-10,12-13,19-20H,11,14H2,1-4H3
51 atoms
O  1.701791 1.660229 0.994062
O  1.605821 0.713692 -1.027081
O  -2.545539 2.450727 1.139177
C  1.823335 -1.936321 0.633082
C  3.20389 -1.619658 0.174213
C  2.383277 -0.539925 0.868883
C  0.714531 -2.161049 -0.365215
C  1.675827 -2.780588 1.876229
C  3.577972 -1.567309 -1.2622
C  1.865457 0.637738 0.150726
C  4.515527 -0.773267 -1.7831
C  4.863747 -0.826112 -3.239005
C  5.267536 0.244579 -0.983048
C  1.033339 2.838717 0.513931
C  -0.438989 2.626932 0.464179
C  -1.230388 2.089096 -0.602898
C  -1.300749 2.828472 1.489275
C  -2.497633 1.999472 -0.136871
C  -3.74121 1.416365 -0.704374
C  -3.959627 0.016168 -0.179155
C  -4.773563 -0.217901 0.924168
C  -3.292329 -1.05846 -0.761993
C  -4.915867 -1.500933 1.438297
C  -3.433895 -2.340685 -0.252163
C  -4.244995 -2.565359 0.853223
H  3.993025 -1.995508 0.821845
H  2.665137 -0.331536 1.89453
H  0.842761 -1.619344 -1.298133
H  0.652849 -3.223291 -0.610828
H  -0.248476 -1.868753 0.05884
H  2.476722 -2.597039 2.593695
H  0.726885 -2.580441 2.378236
H  1.697466 -3.842678 1.621957
H  3.068906 -2.265269 -1.921315
H  4.273744 -1.567819 -3.777518
H  5.920467 -1.066797 -3.383101
H  4.700838 0.144211 -3.7162
H  5.036573 1.254331 -1.33358
H  6.346197 0.117504 -1.10482
H  5.046707 0.20473 0.082082
H  1.432909 3.144232 -0.453441
H  1.286798 3.610251 1.239116
H  -0.894107 1.800402 -1.58546
H  -1.170328 3.222625 2.485706
H  -3.642677 1.398165 -1.790755
H  -4.601706 2.048229 -0.471515
H  -5.301244 0.607892 1.38696
H  -2.652714 -0.889506 -1.621014
H  -5.552278 -1.667849 2.298168
H  -2.910336 -3.165825 -0.718527
H  -4.356347 -3.565436 1.252363
elementType: O C H
totalener: -1079.74919680 hartree
nucrepener: 2175.27101767 hartree
electener: -3255.02021447 hartree
oneelecener: -5790.45179595 hartree
twoeener: 2535.43158148 hartree
cpcmener: -0.02533514 hartree
kineticenergy: 1074.86901118 hartree
xcener: -106.462252428700 hartree
chargesum: 0.0000000
charge: -0.290199 -0.466991 -0.274957 0.144150 -0.024417 -0.097817 -0.314276 -0.265698 -0.265641 0.396055 -0.024884 -0.225077 -0.267486 0.071196 -0.075318 -0.326282 -0.039020 0.214404 -0.062716 0.077385 -0.203759 -0.222028 -0.148317 -0.159229 -0.173377 0.114126 0.094333 0.099240 0.102350 0.097702 0.086234 0.095590 0.092909 0.120924 0.088423 0.094807 0.093467 0.098764 0.104877 0.093983 0.116494 0.118644 0.156456 0.173908 0.112379 0.110183 0.139123 0.145358 0.156364 0.159982 0.157679
qa: -0.2902 -0.4670 -0.2750 0.1441 -0.0244 -0.0978 -0.3143 -0.2657 -0.2656 0.3961 -0.0249 -0.2251 -0.2675 0.0712 -0.0753 -0.3263 -0.0390 0.2144 -0.0627 0.0774 -0.2038 -0.2220 -0.1483 -0.1592 -0.1734 0.1141 0.0943 0.0992 0.1023 0.0977 0.0862 0.0956 0.0929 0.1209 0.0884 0.0948 0.0935 0.0988 0.1049 0.0940 0.1165 0.1186 0.1565 0.1739 0.1124 0.1102 0.1391 0.1454 0.1564 0.1600 0.1577
va: 2.1136 2.0183 2.2789 3.7231 3.8450 3.8162 3.9079 3.9004 3.8549 4.0915 3.7130 3.9264 3.9431 3.8625 3.6491 3.9887 3.9697 3.6224 3.8281 3.5545 3.9671 3.9228 3.8942 3.8796 3.9048 1.0033 1.0301 1.0146 0.9997 0.9965 1.0052 1.0020 1.0021 1.0002 1.0073 0.9966 0.9963 0.9984 0.9999 1.0052 1.0074 0.9963 1.0203 0.9940 1.0090 1.0115 1.0066 1.0019 0.9906 0.9885 0.9903
dispcorr: -0.025361095 hartree
energy: -1079.774557896080
dipole: 17.95221 -17.73571 0.21649 -13.71759 13.67957 -0.03802 -5.40411 6.03102 0.62690
magnitude: 0.66432 au
magnitude: 1.68857 debye
