program: Orca
programVersion: 5.0.2
elementType: O O O C C C C C C C C C C C C C C C C C C C C C C H H H H H H H H H H H H H H H H H H H H H H H H H H
charge: 0
multiplicity: 1
keywords: wb97x-d3
keywords: def2-TZVPP
keywords: def2/J RIJCOSX
keywords: DEFGRID2
keywords: scfconv7
keywords: smallprint printgap noloewdin
keywords: NOSOSCF
formula: C22H26O3
InChI: InChI=1/C22H26O3/c1-15(2)10-19-20(22(19,3)4)21(23)25-14-17-12-18(24-13-17)11-16-8-6-5-7-9-16/h5-10,12-13,19-20H,11,14H2,1-4H3
51 atoms
O  1.510874 1.726448 1.388097
O  2.012253 1.015859 -0.669859
O  -2.005099 2.410325 -1.124135
C  1.122348 -1.708403 0.64307
C  2.608119 -1.736854 0.523037
C  1.94164 -0.531302 1.163388
C  0.252771 -1.551818 -0.580296
C  0.484325 -2.564628 1.71015
C  3.313926 -1.692938 -0.783979
C  1.849501 0.780886 0.502912
C  4.536117 -1.191322 -0.973399
C  5.202952 -1.232346 -2.314111
C  5.322582 -0.522222 0.110667
C  1.017745 2.968928 0.862651
C  -0.34169 2.753402 0.30094
C  -1.499773 2.325629 1.027563
C  -0.713293 2.778989 -0.999071
C  -2.476468 2.125076 0.112913
C  -3.842768 1.546228 0.212084
C  -3.791124 0.049004 0.010906
C  -3.751997 -0.806528 1.108015
C  -3.70954 -0.496946 -1.267853
C  -3.633724 -2.178938 0.9340
C  -3.587418 -1.868284 -1.44456
C  -3.548366 -2.714201 -0.343961
H  3.103607 -2.354494 1.26894
H  2.011435 -0.472361 2.243582
H  0.710997 -0.975542 -1.379996
H  0.010355 -2.535909 -0.987022
H  -0.689831 -1.064777 -0.319712
H  0.300364 -3.573103 1.333116
H  1.114612 -2.65228 2.596091
H  -0.476124 -2.148869 2.022744
H  2.803015 -2.142961 -1.630708
H  4.579255 -1.708339 -3.070973
H  6.150666 -1.775484 -2.26757
H  5.443397 -0.224111 -2.662623
H  6.316531 -0.966937 0.205771
H  4.841278 -0.572701 1.08563
H  5.480772 0.533556 -0.127697
H  1.700288 3.389728 0.122838
H  0.995971 3.641063 1.719647
H  -1.581492 2.169941 2.092304
H  -0.188372 3.033072 -1.90683
H  -4.505899 2.010381 -0.521565
H  -4.24697 1.775186 1.198715
H  -3.814279 -0.39603 2.109259
H  -3.741199 0.15319 -2.13433
H  -3.609469 -2.829997 1.798721
H  -3.523282 -2.277228 -2.444907
H  -3.454139 -3.783687 -0.481492
elementType: O C H
totalener: -1079.74798665 hartree
nucrepener: 2224.36431754 hartree
electener: -3304.11230419 hartree
oneelecener: -5888.75527045 hartree
twoeener: 2584.64296626 hartree
cpcmener: -0.02624058 hartree
kineticenergy: 1074.87043650 hartree
xcener: -106.463349916569 hartree
chargesum: 0.0000000
charge: -0.291659 -0.454791 -0.274143 0.184752 -0.032673 -0.093797 -0.289048 -0.278495 -0.265030 0.360895 -0.026136 -0.225567 -0.266264 0.091786 -0.057045 -0.346886 -0.032110 0.212264 -0.057505 0.042508 -0.173644 -0.187678 -0.174698 -0.160963 -0.165148 0.113999 0.094702 0.104070 0.106544 0.049258 0.096175 0.091010 0.089571 0.119989 0.088550 0.094317 0.093265 0.103321 0.092485 0.098625 0.113186 0.119273 0.156545 0.171965 0.113207 0.106176 0.138559 0.137721 0.157447 0.155146 0.155968
qa: -0.2917 -0.4548 -0.2741 0.1848 -0.0327 -0.0938 -0.2890 -0.2785 -0.2650 0.3609 -0.0261 -0.2256 -0.2663 0.0918 -0.0570 -0.3469 -0.0321 0.2123 -0.0575 0.0425 -0.1736 -0.1877 -0.1747 -0.1610 -0.1651 0.1140 0.0947 0.1041 0.1065 0.0493 0.0962 0.0910 0.0896 0.1200 0.0886 0.0943 0.0933 0.1033 0.0925 0.0986 0.1132 0.1193 0.1565 0.1720 0.1132 0.1062 0.1386 0.1377 0.1574 0.1551 0.1560
va: 2.0995 2.0288 2.2704 3.6739 3.8590 3.8191 3.9075 3.9045 3.8569 4.1505 3.7127 3.9273 3.9447 3.8560 3.6361 3.9832 3.9533 3.6089 3.8217 3.6096 3.8975 3.9238 3.8669 3.8843 3.8538 1.0029 1.0300 1.0205 0.9981 1.0132 1.0012 1.0075 1.0040 1.0010 1.0072 0.9966 0.9963 1.0001 1.0055 0.9980 1.0100 0.9915 1.0112 0.9992 1.0125 1.0118 1.0039 1.0117 0.9909 0.9920 0.9915
dispcorr: -0.027810377 hartree
energy: -1079.775797028847
dipole: 14.69624 -15.05130 -0.35506 -14.76232 14.55562 -0.20670 -0.10328 1.17543 1.07215
magnitude: 1.14817 au
magnitude: 2.91841 debye
