program: Orca
programVersion: 5.0.2
elementType: O O O C C C C C C C C C C C C C C C C C C C C C C H H H H H H H H H H H H H H H H H H H H H H H H H H
charge: 0
multiplicity: 1
keywords: wb97x-d3
keywords: def2-TZVPP
keywords: def2/J RIJCOSX
keywords: DEFGRID2
keywords: scfconv7
keywords: smallprint printgap noloewdin
keywords: NOSOSCF
formula: C22H26O3
InChI: InChI=1/C22H26O3/c1-15(2)10-19-20(22(19,3)4)21(23)25-14-17-12-18(24-13-17)11-16-8-6-5-7-9-16/h5-10,12-13,19-20H,11,14H2,1-4H3
51 atoms
O  1.983896 1.622556 -1.139512
O  2.582614 1.315651 0.990017
O  -1.672867 0.201103 0.883784
C  5.068008 -0.176221 -0.065281
C  3.969474 -1.173308 -0.214387
C  3.802332 0.246792 -0.777174
C  5.446403 0.374158 1.288373
C  6.26392 -0.340165 -0.975651
C  3.147353 -1.648952 0.92659
C  2.764742 1.107584 -0.185745
C  1.914152 -2.148068 0.806612
C  1.144112 -2.640083 1.993354
C  1.197527 -2.257148 -0.504352
C  0.819172 2.351016 -0.72151
C  -0.278762 1.426607 -0.329968
C  -1.129369 0.676165 -1.206106
C  -0.655735 1.085003 0.92445
C  -1.955191 -0.049702 -0.416809
C  -3.076704 -0.982246 -0.704949
C  -4.421603 -0.350919 -0.432138
C  -5.129136 0.266225 -1.459502
C  -4.958172 -0.340212 0.85261
C  -6.347847 0.882457 -1.210827
C  -6.174881 0.278657 1.105022
C  -6.873257 0.892614 0.073965
H  4.113846 -1.905602 -1.004402
H  3.872361 0.322173 -1.856307
H  5.840433 1.387951 1.193852
H  4.629071 0.405367 2.002342
H  6.237251 -0.243068 1.719967
H  6.989904 -1.027865 -0.537012
H  5.984454 -0.735568 -1.953376
H  6.767433 0.61541 -1.136537
H  3.593372 -1.605534 1.915664
H  0.809766 -3.671081 1.848613
H  0.240657 -2.04134 2.140923
H  1.728755 -2.600858 2.912546
H  1.180425 -3.294642 -0.849062
H  1.645846 -1.654686 -1.292393
H  0.15465 -1.951334 -0.402771
H  0.536199 2.939856 -1.593059
H  1.062948 3.044627 0.08399
H  -1.123273 0.685337 -2.285224
H  -0.310814 1.384925 1.901701
H  -2.962915 -1.894808 -0.113238
H  -3.008258 -1.275103 -1.753352
H  -4.723925 0.262907 -2.46485
H  -4.424893 -0.8228 1.663293
H  -6.888199 1.353257 -2.022375
H  -6.579322 0.279783 2.109311
H  -7.823385 1.373025 0.270009
elementType: O C H
totalener: -1079.75053243 hartree
nucrepener: 2156.40165917 hartree
electener: -3236.15219160 hartree
oneelecener: -5752.42064338 hartree
twoeener: 2516.26845178 hartree
cpcmener: -0.02552196 hartree
kineticenergy: 1074.86868826 hartree
xcener: -106.463301427233 hartree
chargesum: -0.0000000
charge: -0.288089 -0.463329 -0.282107 0.137947 -0.026865 -0.094423 -0.297404 -0.265695 -0.269746 0.371275 -0.004039 -0.218586 -0.284988 0.086816 -0.041625 -0.355826 -0.028570 0.214948 -0.069488 0.075662 -0.201241 -0.206474 -0.151905 -0.157301 -0.171816 0.111993 0.092770 0.100363 0.093565 0.096532 0.094266 0.085517 0.095419 0.120166 0.097759 0.086903 0.089126 0.119668 0.095130 0.084736 0.118930 0.116146 0.153590 0.166563 0.117788 0.108442 0.138708 0.139875 0.155700 0.155773 0.157443
qa: -0.2881 -0.4633 -0.2821 0.1379 -0.0269 -0.0944 -0.2974 -0.2657 -0.2697 0.3713 -0.0040 -0.2186 -0.2850 0.0868 -0.0416 -0.3558 -0.0286 0.2149 -0.0695 0.0757 -0.2012 -0.2065 -0.1519 -0.1573 -0.1718 0.1120 0.0928 0.1004 0.0936 0.0965 0.0943 0.0855 0.0954 0.1202 0.0978 0.0869 0.0891 0.1197 0.0951 0.0847 0.1189 0.1161 0.1536 0.1666 0.1178 0.1084 0.1387 0.1399 0.1557 0.1558 0.1574
va: 2.1068 2.0244 2.2575 3.7521 3.8139 3.8182 3.8901 3.8991 3.8511 4.1512 3.6762 3.9216 3.9498 3.8419 3.5583 3.9966 3.9273 3.5561 3.8107 3.5607 3.9462 3.9632 3.8953 3.9030 3.9007 1.0043 1.0303 1.0003 1.0178 0.9989 1.0025 1.0043 1.0024 1.0031 0.9956 1.0022 1.0085 0.9997 1.0067 0.9978 0.9918 1.0121 1.0120 1.0048 1.0054 1.0100 1.0049 1.0108 0.9912 0.9914 0.9904
dispcorr: -0.026361897 hartree
energy: -1079.776894326538
dipole: 16.61932 -16.75338 -0.13406 -10.62832 10.18876 -0.43956 0.66348 -1.84837 -1.18490
magnitude: 1.27089 au
magnitude: 3.23035 debye
