program: Orca
programVersion: 5.0.2
elementType: O O O C C C C C C C C C C C C C C C C C C C C C C H H H H H H H H H H H H H H H H H H H H H H H H H H
charge: 0
multiplicity: 1
keywords: wb97x-d3
keywords: def2-TZVPP
keywords: def2/J RIJCOSX
keywords: DEFGRID2
keywords: scfconv7
keywords: smallprint printgap noloewdin
keywords: NOSOSCF
formula: C22H26O3
InChI: InChI=1/C22H26O3/c1-15(2)10-19-20(22(19,3)4)21(23)25-14-17-12-18(24-13-17)11-16-8-6-5-7-9-16/h5-10,12-13,19-20H,11,14H2,1-4H3
51 atoms
O  1.70995 2.068439 1.135739
O  1.97652 1.162528 -0.887376
O  -2.004844 2.648803 -1.125148
C  1.158371 -1.395049 0.780218
C  2.635507 -1.514662 0.546314
C  2.065984 -0.210847 1.085428
C  0.196808 -1.351279 -0.38205
C  0.585316 -2.095777 1.988034
C  3.236124 -1.6623 -0.794598
C  1.932868 1.037645 0.31322
C  4.177409 -2.552153 -1.131543
C  4.714194 -2.598238 -2.531427
C  4.796396 -3.552479 -0.201848
C  1.184421 3.273593 0.556807
C  -0.219146 3.036788 0.129408
C  -1.303621 2.63036 0.972642
C  -0.708493 3.022163 -1.13089
C  -2.359259 2.399972 0.157995
C  -3.709795 1.825906 0.398128
C  -3.685133 0.32645 0.206525
C  -3.509436 -0.518109 1.299017
C  -3.77037 -0.232371 -1.066252
C  -3.423147 -1.893022 1.126075
C  -3.682333 -1.606652 -1.242234
C  -3.508061 -2.441616 -0.146387
H  3.154345 -2.059857 1.32711
H  2.239142 -0.042786 2.142333
H  -0.130641 -2.365491 -0.619069
H  -0.693104 -0.771917 -0.125674
H  0.614791 -0.928515 -1.291652
H  0.33419 -3.1312 1.747766
H  1.286077 -2.10984 2.823968
H  -0.32871 -1.603613 2.327886
H  2.881904 -1.001221 -1.574834
H  4.527938 -3.571409 -2.994188
H  5.798706 -2.457375 -2.541119
H  4.271967 -1.832857 -3.169454
H  4.277304 -3.654478 0.748389
H  5.834871 -3.288657 0.013767
H  4.822434 -4.540407 -0.666791
H  1.805763 3.625785 -0.268069
H  1.242939 4.008891 1.358543
H  -1.287609 2.506046 2.044549
H  -0.269389 3.247194 -2.090521
H  -4.441919 2.285967 -0.269893
H  -4.013023 2.065466 1.418033
H  -3.439327 -0.09742 2.295589
H  -3.910161 0.409399 -1.92838
H  -3.290941 -2.536012 1.987092
H  -3.752823 -2.025921 -2.23796
H  -3.441043 -3.513338 -0.283375
elementType: O C H
totalener: -1079.74888524 hartree
nucrepener: 2205.78232093 hartree
electener: -3285.53120617 hartree
oneelecener: -5851.35347924 hartree
twoeener: 2565.82227307 hartree
cpcmener: -0.02541086 hartree
kineticenergy: 1074.86051896 hartree
xcener: -106.463324504139 hartree
chargesum: -0.0000000
charge: -0.289104 -0.459303 -0.274003 0.162483 0.014068 -0.069297 -0.275893 -0.278760 -0.300218 0.360026 -0.039625 -0.222485 -0.263142 0.093946 -0.055815 -0.351720 -0.032887 0.212071 -0.058400 0.048192 -0.182335 -0.184717 -0.170900 -0.154598 -0.171414 0.112353 0.094971 0.106125 0.049757 0.102778 0.096859 0.091668 0.086982 0.120849 0.092564 0.091441 0.088345 0.089948 0.100071 0.092161 0.113588 0.119623 0.156354 0.172764 0.113286 0.106760 0.137732 0.138080 0.157446 0.155196 0.156128
qa: -0.2891 -0.4593 -0.2740 0.1625 0.0141 -0.0693 -0.2759 -0.2788 -0.3002 0.3600 -0.0396 -0.2225 -0.2631 0.0939 -0.0558 -0.3517 -0.0329 0.2121 -0.0584 0.0482 -0.1823 -0.1847 -0.1709 -0.1546 -0.1714 0.1124 0.0950 0.1061 0.0498 0.1028 0.0969 0.0917 0.0870 0.1208 0.0926 0.0914 0.0883 0.0899 0.1001 0.0922 0.1136 0.1196 0.1564 0.1728 0.1133 0.1068 0.1377 0.1381 0.1574 0.1552 0.1561
va: 2.1016 2.0310 2.2714 3.6354 3.7681 3.8421 3.9183 3.9143 3.8617 4.1694 3.7587 3.9258 3.9420 3.8545 3.6364 3.9804 3.9588 3.6070 3.8198 3.5977 3.8889 3.9339 3.8523 3.8871 3.8560 1.0050 1.0300 0.9997 1.0111 1.0208 1.0004 1.0082 1.0042 1.0288 0.9966 0.9951 1.0090 1.0109 0.9954 0.9982 1.0091 0.9913 1.0116 0.9979 1.0121 1.0117 1.0047 1.0108 0.9906 0.9916 0.9918
dispcorr: -0.027107646 hartree
energy: -1079.775992884262
dipole: 13.05005 -13.40943 -0.35938 -21.67571 21.32159 -0.35412 0.34173 0.82966 1.17138
magnitude: 1.27542 au
magnitude: 3.24186 debye
