program: Orca
programVersion: 5.0.2
elementType: O O O C C C C C C C C C C C C C C C C C C C C C C H H H H H H H H H H H H H H H H H H H H H H H H H H
charge: 0
multiplicity: 1
keywords: wb97x-d3
keywords: def2-TZVPP
keywords: def2/J RIJCOSX
keywords: DEFGRID2
keywords: scfconv7
keywords: smallprint printgap noloewdin
keywords: NOSOSCF
formula: C22H26O3
InChI: InChI=1/C22H26O3/c1-15(2)10-19-20(22(19,3)4)21(23)25-14-17-12-18(24-13-17)11-16-8-6-5-7-9-16/h5-10,12-13,19-20H,11,14H2,1-4H3
51 atoms
O  2.209367 2.093183 0.023327
O  1.625672 0.35326 1.299929
O  -1.707503 2.306337 -1.936992
C  4.384201 -0.858308 0.547208
C  3.486963 -1.226647 -0.58392
C  3.562798 0.228102 -0.113742
C  4.084271 -1.326536 1.949929
C  5.865921 -0.793521 0.254195
C  2.260727 -2.039774 -0.396804
C  2.373974 0.853261 0.502494
C  1.159336 -1.934379 -1.139406
C  -0.044896 -2.782003 -0.870641
C  1.005025 -0.94311 -2.251233
C  1.036466 2.802199 0.428224
C  -0.17021 2.383982 -0.338646
C  -1.114077 1.352111 -0.028286
C  -0.589888 2.917572 -1.510064
C  -2.025068 1.353425 -1.030461
C  -3.227185 0.526376 -1.330271
C  -3.755045 -0.191121 -0.117177
C  -3.745341 -1.577889 -0.044672
C  -4.278923 0.529696 0.953018
C  -4.245883 -2.235722 1.071033
C  -4.781626 -0.122075 2.066352
C  -4.766426 -1.509404 2.129048
H  3.987085 -1.377959 -1.537757
H  4.113348 0.896753 -0.765521
H  4.542961 -0.6562 2.678813
H  3.023124 -1.37642 2.173184
H  4.513811 -2.318939 2.102948
H  6.368398 -0.098783 0.929639
H  6.326625 -1.774952 0.382214
H  6.067188 -0.466715 -0.767083
H  2.27476 -2.770276 0.405457
H  -0.894483 -2.153663 -0.589789
H  0.124045 -3.491104 -0.061397
H  -0.344054 -3.344879 -1.758684
H  0.721842 -1.441329 -3.181972
H  1.908598 -0.367135 -2.441042
H  0.20668 -0.234281 -2.015468
H  1.267313 3.848256 0.228199
H  0.871705 2.692854 1.50116
H  -1.100396 0.700063 0.829165
H  -0.207045 3.716579 -2.12502
H  -2.990811 -0.20127 -2.113834
H  -4.008471 1.169405 -1.747911
H  -3.3445 -2.153705 -0.870539
H  -4.289235 1.612434 0.913336
H  -4.228874 -3.316923 1.109798
H  -5.187813 0.453107 2.88813
H  -5.15958 -2.018769 2.998922
totalener: -1079.72819320 hartree
nucrepener: 2206.72866477 hartree
electener: -3286.45685796 hartree
oneelecener: -5852.07989717 hartree
twoeener: 2565.62303921 hartree
kineticenergy: 1074.91163110 hartree
xcener: -106.469354471460 hartree
chargesum: 0.0000000
charge: -0.264512 -0.388727 -0.257999 0.136122 -0.054189 -0.118062 -0.283277 -0.244497 -0.180440 0.363478 0.012947 -0.186873 -0.255772 0.047084 -0.072989 -0.250196 -0.022639 0.189402 -0.090755 0.049157 -0.167605 -0.186405 -0.118327 -0.102797 -0.134653 0.093746 0.082142 0.083864 0.108738 0.086397 0.089896 0.087023 0.070382 0.081784 0.053524 0.078626 0.083557 0.097175 0.087643 0.083465 0.099340 0.109597 0.154977 0.136204 0.090885 0.111291 0.121234 0.117040 0.124021 0.125258 0.124709
qa: -0.2645 -0.3887 -0.2580 0.1361 -0.0542 -0.1181 -0.2833 -0.2445 -0.1804 0.3635 0.0129 -0.1869 -0.2558 0.0471 -0.0730 -0.2502 -0.0226 0.1894 -0.0908 0.0492 -0.1676 -0.1864 -0.1183 -0.1028 -0.1347 0.0937 0.0821 0.0839 0.1087 0.0864 0.0899 0.0870 0.0704 0.0818 0.0535 0.0786 0.0836 0.0972 0.0876 0.0835 0.0993 0.1096 0.1550 0.1362 0.0909 0.1113 0.1212 0.1170 0.1240 0.1253 0.1247
va: 2.1174 2.0942 2.2971 3.7283 3.9023 3.8266 3.9076 3.9036 3.9034 4.1437 3.7298 3.9346 3.9622 3.9232 3.6810 3.9096 3.9768 3.5859 3.8314 3.6146 3.9630 4.0075 3.9814 3.9361 3.9729 1.0048 1.0320 1.0054 1.0196 0.9976 1.0049 1.0046 1.0072 1.0129 1.0079 1.0169 0.9995 1.0033 1.0109 0.9925 0.9957 1.0070 1.0182 1.0081 1.0076 1.0070 1.0021 1.0087 1.0016 0.9996 1.0000
dispcorr: -0.027653879 hartree
energy: -1079.755847073961
dipole: 13.23276 -13.14732 0.08543 -13.96177 14.12619 0.16442 -0.14952 -0.14337 -0.29290
magnitude: 0.34659 au
magnitude: 0.88095 debye
