program: Orca
programVersion: 5.0.2
elementType: O O O C C C C C C C C C C C C C C C C C C C C C C H H H H H H H H H H H H H H H H H H H H H H H H H H
charge: 0
multiplicity: 1
keywords: wb97x-d3
keywords: def2-TZVPP
keywords: def2/J RIJCOSX
keywords: DEFGRID2
keywords: scfconv7
keywords: smallprint printgap noloewdin
keywords: NOSOSCF
formula: C22H26O3
InChI: InChI=1/C22H26O3/c1-15(2)10-19-20(22(19,3)4)21(23)25-14-17-12-18(24-13-17)11-16-8-6-5-7-9-16/h5-10,12-13,19-20H,11,14H2,1-4H3
51 atoms
O  2.157522 2.009935 0.122769
O  2.208207 0.243467 1.492826
O  -2.106334 1.497102 -1.066331
C  4.930486 -0.479175 0.238114
C  3.94695 -0.912472 -0.795177
C  3.87527 0.504202 -0.212834
C  4.921649 -1.082061 1.621972
C  6.327901 -0.167149 -0.248848
C  2.880606 -1.907067 -0.526128
C  2.684571 0.869466 0.582478
C  1.753473 -2.013241 -1.230534
C  0.729813 -3.05785 -0.908493
C  1.395504 -1.098491 -2.360713
C  0.937911 2.461217 0.717532
C  -0.259545 1.801505 0.128748
C  -0.748055 0.472604 0.350045
C  -1.131632 2.363635 -0.741047
C  -1.867802 0.346857 -0.399398
C  -2.849734 -0.756112 -0.573787
C  -4.161282 -0.476374 0.120246
C  -5.172255 0.22956 -0.522055
C  -4.366018 -0.896292 1.42962
C  -6.36413 0.507582 0.130241
C  -5.557146 -0.622942 2.084012
C  -6.560662 0.081223 1.435263
H  4.323351 -0.922791 -1.814708
H  4.215132 1.292152 -0.87502
H  5.527967 -1.990151 1.625763
H  5.365397 -0.389101 2.338468
H  3.930037 -1.331617 1.984303
H  6.82595 0.538555 0.418022
H  6.932642 -1.075018 -0.285345
H  6.326771 0.267354 -1.24943
H  3.042738 -2.597132 0.294801
H  1.024714 -3.676234 -0.06169
H  0.552462 -3.716466 -1.762389
H  -0.230775 -2.593898 -0.66826
H  1.171151 -1.665954 -3.267314
H  2.1793 -0.381908 -2.597071
H  0.496175 -0.528456 -2.112788
H  0.909949 3.532463 0.518946
H  0.967948 2.319548 1.799004
H  -0.310374 -0.278524 0.986163
H  -1.179431 3.340675 -1.194903
H  -2.404309 -1.667714 -0.171515
H  -3.021106 -0.939449 -1.638468
H  -5.026514 0.566067 -1.541341
H  -3.584148 -1.443004 1.943625
H  -7.14209 1.057656 -0.382896
H  -5.702495 -0.962312 3.101295
H  -7.491807 0.294639 1.943329
totalener: -1079.72869593 hartree
nucrepener: 2160.22988804 hartree
electener: -3239.95858398 hartree
oneelecener: -5758.90860284 hartree
twoeener: 2518.95001886 hartree
kineticenergy: 1074.91600440 hartree
xcener: -106.468992069487 hartree
chargesum: 0.0000000
charge: -0.263101 -0.399201 -0.261087 0.144472 -0.062067 -0.115309 -0.277872 -0.244279 -0.162117 0.375397 -0.017616 -0.198133 -0.252762 0.053873 -0.038491 -0.329185 -0.034890 0.265537 -0.128230 0.092240 -0.168375 -0.168185 -0.122635 -0.119689 -0.134040 0.089901 0.080455 0.087146 0.085260 0.102055 0.090106 0.088260 0.069997 0.083566 0.083284 0.090636 0.053364 0.094972 0.084337 0.094649 0.093823 0.112783 0.151160 0.133558 0.097873 0.111882 0.108694 0.107074 0.122735 0.123801 0.124375
qa: -0.2631 -0.3992 -0.2611 0.1445 -0.0621 -0.1153 -0.2779 -0.2443 -0.1621 0.3754 -0.0176 -0.1981 -0.2528 0.0539 -0.0385 -0.3292 -0.0349 0.2655 -0.1282 0.0922 -0.1684 -0.1682 -0.1226 -0.1197 -0.1340 0.0899 0.0805 0.0871 0.0853 0.1021 0.0901 0.0883 0.0700 0.0836 0.0833 0.0906 0.0534 0.0950 0.0843 0.0946 0.0938 0.1128 0.1512 0.1336 0.0979 0.1119 0.1087 0.1071 0.1227 0.1238 0.1244
va: 2.1199 2.0833 2.3065 3.7405 3.8905 3.8548 3.9069 3.9037 3.8734 4.1357 3.7513 3.9375 3.9553 3.9162 3.7051 4.0100 4.0030 3.5235 3.8589 3.6248 4.0215 4.0000 3.9575 3.9648 3.9620 1.0055 1.0323 0.9976 1.0051 1.0221 1.0052 1.0046 1.0070 1.0138 1.0120 1.0021 1.0053 1.0022 1.0104 0.9936 0.9968 1.0062 1.0239 1.0078 1.0120 1.0052 1.0172 1.0113 1.0006 1.0007 1.0000
dispcorr: -0.026372395 hartree
energy: -1079.755068329791
dipole: 16.77594 -16.66976 0.10618 -12.16176 12.33495 0.17319 -3.21335 2.77215 -0.44120
magnitude: 0.48572 au
magnitude: 1.23461 debye
