program: Orca
programVersion: 5.0.2
elementType: O O O C C C C C C C C C C C C C C C C C C C C C C H H H H H H H H H H H H H H H H H H H H H H H H H H
charge: 0
multiplicity: 1
keywords: wb97x-d3
keywords: def2-TZVPP
keywords: def2/J RIJCOSX
keywords: DEFGRID2
keywords: scfconv7
keywords: smallprint printgap noloewdin
keywords: NOSOSCF
formula: C22H26O3
InChI: InChI=1/C22H26O3/c1-15(2)10-19-20(22(19,3)4)21(23)25-14-17-12-18(24-13-17)11-16-8-6-5-7-9-16/h5-10,12-13,19-20H,11,14H2,1-4H3
51 atoms
O  1.656728 1.30426 -1.375966
O  2.80556 1.561268 0.522449
O  -1.249421 1.167767 1.909936
C  4.719686 -0.632511 -0.455524
C  3.493473 -1.418772 -0.130161
C  3.397467 -0.17591 -1.022666
C  5.446918 0.147463 0.613272
C  5.664133 -1.238199 -1.469835
C  2.885461 -1.443766 1.223173
C  2.63117 0.982011 -0.51687
C  1.604598 -1.72102 1.470673
C  1.06766 -1.758468 2.869037
C  0.596769 -1.994011 0.396323
C  0.735519 2.311567 -0.948073
C  -0.265476 1.781108 0.019399
C  -1.53068 1.181711 -0.283159
C  -0.156603 1.737046 1.368304
C  -2.084345 0.831033 0.901335
C  -3.367047 0.173298 1.274507
C  -4.208491 -0.115845 0.06219
C  -5.101204 0.833945 -0.422266
C  -4.085892 -1.324263 -0.613689
C  -5.86137 0.579758 -1.553706
C  -4.845019 -1.58338 -1.745286
C  -5.73578 -0.631391 -2.218054
H  3.376895 -2.342395 -0.691021
H  3.235531 -0.378513 -2.075367
H  5.99168 0.981959 0.168963
H  4.795779 0.557487 1.377558
H  6.179538 -0.501481 1.097298
H  5.134866 -1.806428 -2.235913
H  6.245074 -0.463811 -1.973622
H  6.366128 -1.917121 -0.982729
H  3.539831 -1.236865 2.063305
H  0.65323 -2.742143 3.105719
H  0.255037 -1.038819 2.993188
H  1.834447 -1.531635 3.60874
H  -0.198037 -1.244151 0.419437
H  0.119277 -2.965862 0.548417
H  1.022523 -1.980103 -0.604866
H  0.241696 2.640761 -1.861426
H  1.271133 3.164104 -0.528407
H  -1.967723 1.035271 -1.257719
H  0.621486 2.046018 2.045821
H  -3.920864 0.810683 1.970917
H  -3.161934 -0.7555 1.816755
H  -5.20117 1.782496 0.091826
H  -3.389452 -2.070714 -0.250078
H  -6.554794 1.327792 -1.915226
H  -4.742903 -2.531288 -2.257109
H  -6.331506 -0.83316 -3.098432
totalener: -1079.72938167 hartree
nucrepener: 2184.90241115 hartree
electener: -3264.63179283 hartree
oneelecener: -5808.25314410 hartree
twoeener: 2543.62135127 hartree
kineticenergy: 1074.91132916 hartree
xcener: -106.469642837084 hartree
chargesum: -0.0000000
charge: -0.264995 -0.396915 -0.261679 0.146355 -0.062285 -0.111083 -0.274384 -0.246400 -0.175347 0.362421 -0.005337 -0.214249 -0.229012 0.053378 -0.079426 -0.224172 0.005537 0.140264 -0.052099 0.029774 -0.156422 -0.157205 -0.123682 -0.125476 -0.127285 0.089472 0.079967 0.085239 0.100559 0.086080 0.069890 0.089997 0.088399 0.083997 0.085886 0.080649 0.078967 0.062818 0.095554 0.086049 0.100220 0.113816 0.134968 0.151087 0.096765 0.094096 0.111018 0.108104 0.125086 0.124938 0.126103
qa: -0.2650 -0.3969 -0.2617 0.1464 -0.0623 -0.1111 -0.2744 -0.2464 -0.1753 0.3624 -0.0053 -0.2142 -0.2290 0.0534 -0.0794 -0.2242 0.0055 0.1403 -0.0521 0.0298 -0.1564 -0.1572 -0.1237 -0.1255 -0.1273 0.0895 0.0800 0.0852 0.1006 0.0861 0.0699 0.0900 0.0884 0.0840 0.0859 0.0806 0.0790 0.0628 0.0956 0.0860 0.1002 0.1138 0.1350 0.1511 0.0968 0.0941 0.1110 0.1081 0.1251 0.1249 0.1261
va: 2.1213 2.0874 2.2814 3.7400 3.8923 3.8385 3.9062 3.9029 3.8815 4.1719 3.7434 3.9340 3.9516 3.8786 3.6503 3.9478 3.9301 3.6724 3.8533 3.6538 3.9873 3.9828 3.9599 3.9702 3.9528 1.0060 1.0319 1.0056 1.0217 0.9976 1.0069 1.0051 1.0046 1.0131 0.9986 1.0085 1.0116 1.0036 1.0038 1.0133 0.9941 1.0091 1.0108 1.0175 1.0083 1.0067 1.0109 1.0120 1.0004 1.0004 0.9995
dispcorr: -0.027278541 hartree
energy: -1079.756660213398
dipole: 14.01216 -14.49096 -0.47880 -11.96183 11.61567 -0.34616 1.18343 -1.72379 -0.54036
magnitude: 0.80066 au
magnitude: 2.03513 debye
