program: Orca
programVersion: 5.0.2
elementType: O O O C C C C C C C C C C C C C C C C C C C C C C H H H H H H H H H H H H H H H H H H H H H H H H H H
charge: 0
multiplicity: 1
keywords: wb97x-d3
keywords: def2-TZVPP
keywords: def2/J RIJCOSX
keywords: DEFGRID2
keywords: scfconv7
keywords: smallprint printgap noloewdin
keywords: NOSOSCF
formula: C22H26O3
InChI: InChI=1/C22H26O3/c1-15(2)10-19-20(22(19,3)4)21(23)25-14-17-12-18(24-13-17)11-16-8-6-5-7-9-16/h5-10,12-13,19-20H,11,14H2,1-4H3
51 atoms
O  1.869266 2.067944 -0.329265
O  1.089224 0.247934 -1.366515
O  -2.039323 3.760898 0.843227
C  2.175956 -1.142787 1.230467
C  3.245658 -1.348678 0.200461
C  2.676399 0.045118 0.427625
C  0.7899 -1.69774 1.011312
C  2.599976 -1.168738 2.679851
C  3.038271 -2.128879 -1.03344
C  1.797798 0.749094 -0.530919
C  3.830682 -3.109474 -1.475529
C  3.502377 -3.838795 -2.745182
C  5.080727 -3.591363 -0.801885
C  0.963154 2.902961 -1.05795
C  -0.360105 2.984483 -0.382715
C  -1.384281 1.985046 -0.308049
C  -0.822938 4.032166 0.337915
C  -2.373324 2.511085 0.451129
C  -3.691022 1.989662 0.909347
C  -3.842283 0.523374 0.608227
C  -3.13123 -0.420069 1.344701
C  -4.670851 0.083543 -0.415541
C  -3.247362 -1.771504 1.064614
C  -4.792941 -1.270293 -0.698142
C  -4.081497 -2.201093 0.041318
H  4.242153 -1.436403 0.619628
H  3.327165 0.717795 0.974001
H  0.47878 -1.708663 -0.028404
H  0.748517 -2.723976 1.380731
H  0.053034 -1.113857 1.566566
H  1.919742 -0.579916 3.298288
H  2.597109 -2.191585 3.061538
H  3.604808 -0.767801 2.819928
H  2.165443 -1.886851 -1.625541
H  2.595834 -3.458207 -3.213405
H  3.362665 -4.907124 -2.559744
H  4.315917 -3.753449 -3.470468
H  5.304973 -3.086952 0.135739
H  5.945812 -3.467704 -1.459014
H  5.009345 -4.660565 -0.585586
H  0.864997 2.553242 -2.08655
H  1.438116 3.883635 -1.077325
H  -1.374284 1.007785 -0.759968
H  -0.406437 4.999996 0.56809
H  -4.502066 2.552963 0.437202
H  -3.793951 2.162065 1.985618
H  -2.475203 -0.089995 2.141622
H  -5.226445 0.806138 -1.001275
H  -2.685682 -2.491449 1.645561
H  -5.44405 -1.595473 -1.498848
H  -4.174789 -3.256547 -0.177645
totalener: -1079.73002988 hartree
nucrepener: 2146.40704298 hartree
electener: -3226.13707286 hartree
oneelecener: -5731.29193344 hartree
twoeener: 2505.15486058 hartree
kineticenergy: 1074.89917575 hartree
xcener: -106.467269452170 hartree
chargesum: -0.0000000
charge: -0.262591 -0.412245 -0.256610 0.112131 0.019876 -0.086887 -0.270716 -0.242128 -0.218002 0.369240 -0.045231 -0.207733 -0.243295 0.064518 -0.084339 -0.235251 -0.039063 0.180830 -0.062910 0.029830 -0.184285 -0.137735 -0.113788 -0.123310 -0.125471 0.086397 0.081290 0.105599 0.088831 0.073963 0.088435 0.087502 0.070868 0.112192 0.081944 0.080511 0.081258 0.075797 0.087716 0.084312 0.113733 0.092678 0.164254 0.134851 0.086180 0.101314 0.117131 0.106750 0.123440 0.123422 0.124795
qa: -0.2626 -0.4122 -0.2566 0.1121 0.0199 -0.0869 -0.2707 -0.2421 -0.2180 0.3692 -0.0452 -0.2077 -0.2433 0.0645 -0.0843 -0.2353 -0.0391 0.1808 -0.0629 0.0298 -0.1843 -0.1377 -0.1138 -0.1233 -0.1255 0.0864 0.0813 0.1056 0.0888 0.0740 0.0884 0.0875 0.0709 0.1122 0.0819 0.0805 0.0813 0.0758 0.0877 0.0843 0.1137 0.0927 0.1643 0.1349 0.0862 0.1013 0.1171 0.1067 0.1234 0.1234 0.1248
va: 2.1337 2.0677 2.3021 3.7434 3.8001 3.9036 3.9288 3.9073 3.8936 4.1405 3.7941 3.9396 3.9470 3.8982 3.7651 3.9609 3.9974 3.6636 3.8562 3.6661 3.9712 3.9819 3.9316 3.9706 3.9665 1.0103 1.0308 1.0167 1.0040 1.0055 1.0044 1.0035 1.0091 1.0288 1.0123 0.9982 0.9980 1.0162 0.9985 0.9997 1.0077 0.9963 1.0104 1.0081 1.0098 1.0059 1.0068 1.0115 1.0003 1.0008 0.9995
dispcorr: -0.024310314 hartree
energy: -1079.754340194489
dipole: 16.77389 -16.55890 0.21499 -23.02411 23.00730 -0.01681 1.17241 -0.73196 0.44045
magnitude: 0.49041 au
magnitude: 1.24651 debye
