program: Orca
programVersion: 5.0.2
elementType: O O O C C C C C C C C C C C C C C C C C C C C C C H H H H H H H H H H H H H H H H H H H H H H H H H H
charge: 0
multiplicity: 1
keywords: wb97x-d3
keywords: def2-TZVPP
keywords: def2/J RIJCOSX
keywords: DEFGRID2
keywords: scfconv7
keywords: smallprint printgap noloewdin
keywords: NOSOSCF
formula: C22H26O3
InChI: InChI=1/C22H26O3/c1-15(2)10-19-20(22(19,3)4)21(23)25-14-17-12-18(24-13-17)11-16-8-6-5-7-9-16/h5-10,12-13,19-20H,11,14H2,1-4H3
51 atoms
O  2.090563 1.68321 -1.160263
O  2.520117 1.282078 0.996117
O  -1.631768 0.243863 0.687048
C  5.057562 -0.200403 0.088737
C  3.97361 -1.176551 -0.221841
C  3.866587 0.271281 -0.713038
C  5.301348 0.265475 1.503629
C  6.337647 -0.332969 -0.705559
C  3.044473 -1.707106 0.806338
C  2.786896 1.117868 -0.164863
C  1.817317 -2.161458 0.550005
C  0.932905 -2.688888 1.637905
C  1.207166 -2.156452 -0.81762
C  0.921335 2.416424 -0.785304
C  -0.214696 1.513329 -0.454096
C  -1.107467 0.865879 -1.367122
C  -0.588342 1.087133 0.775327
C  -1.943947 0.107876 -0.619546
C  -3.074951 -0.792082 -0.961941
C  -4.399379 -0.306493 -0.424132
C  -5.025623 -0.958712 0.629163
C  -5.008738 0.816812 -0.973952
C  -6.241529 -0.504728 1.121387
C  -6.222851 1.272113 -0.487405
C  -6.844662 0.610504 0.562865
H  4.198152 -1.871692 -1.026951
H  4.035073 0.412621 -1.774635
H  5.98871 -0.424328 1.997762
H  5.771256 1.250291 1.502014
H  4.399858 0.337246 2.102677
H  6.154578 -0.672028 -1.726247
H  6.862746 0.622139 -0.762869
H  7.008291 -1.053964 -0.234622
H  3.399555 -1.726602 1.831181
H  1.422977 -2.671036 2.610447
H  0.624879 -3.71767 1.434333
H  0.017828 -2.095606 1.710071
H  0.888311 -3.161671 -1.105279
H  1.880758 -1.784234 -1.586609
H  0.314645 -1.526563 -0.836777
H  0.685591 3.025502 -1.657454
H  1.140586 3.088822 0.04536
H  -1.11485 0.953116 -2.442193
H  -0.197081 1.281705 1.75985
H  -2.874467 -1.801198 -0.589555
H  -3.118819 -0.871636 -2.050269
H  -4.558954 -1.831001 1.070864
H  -4.523812 1.342619 -1.788287
H  -6.716775 -1.02477 1.942807
H  -6.686181 2.145294 -0.927839
H  -7.793352 0.964892 0.943755
totalener: -1079.72873703 hartree
nucrepener: 2162.30473978 hartree
electener: -3242.03347680 hartree
oneelecener: -5763.14054792 hartree
twoeener: 2521.10707111 hartree
kineticenergy: 1074.92177448 hartree
xcener: -106.470234220985 hartree
chargesum: -0.0000000
charge: -0.266470 -0.393482 -0.255252 0.142097 -0.061440 -0.107859 -0.276718 -0.245162 -0.176302 0.360023 -0.001424 -0.210539 -0.236032 0.053416 -0.067099 -0.279421 0.012643 0.198961 -0.122844 0.081333 -0.145761 -0.161261 -0.125481 -0.128469 -0.127467 0.090719 0.080201 0.086084 0.084891 0.103169 0.069470 0.089862 0.088380 0.082984 0.078502 0.084224 0.080139 0.097524 0.083890 0.070378 0.100434 0.111328 0.122248 0.146829 0.095514 0.109611 0.104187 0.109488 0.122946 0.123046 0.123959
qa: -0.2665 -0.3935 -0.2553 0.1421 -0.0614 -0.1079 -0.2767 -0.2452 -0.1763 0.3600 -0.0014 -0.2105 -0.2360 0.0534 -0.0671 -0.2794 0.0126 0.1990 -0.1228 0.0813 -0.1458 -0.1613 -0.1255 -0.1285 -0.1275 0.0907 0.0802 0.0861 0.0849 0.1032 0.0695 0.0899 0.0884 0.0830 0.0785 0.0842 0.0801 0.0975 0.0839 0.0704 0.1004 0.1113 0.1222 0.1468 0.0955 0.1096 0.1042 0.1095 0.1229 0.1230 0.1240
va: 2.1193 2.0906 2.2929 3.7378 3.8930 3.8346 3.9054 3.9035 3.8853 4.1642 3.7444 3.9367 3.9519 3.8986 3.6419 3.9972 3.9413 3.5902 3.8692 3.6268 4.0045 3.9949 3.9635 3.9692 3.9564 1.0056 1.0314 0.9976 1.0052 1.0214 1.0070 1.0051 1.0046 1.0134 1.0122 0.9986 1.0068 1.0037 1.0124 1.0001 0.9924 1.0103 1.0197 1.0164 1.0088 1.0060 1.0124 1.0120 1.0010 1.0008 1.0001
dispcorr: -0.026494045 hartree
energy: -1079.755231072078
dipole: 16.20094 -16.33355 -0.13261 -10.72391 10.56728 -0.15662 0.67129 -1.36502 -0.69373
magnitude: 0.72345 au
magnitude: 1.83886 debye
