program: Orca
programVersion: 5.0.2
elementType: O O O C C C C C C C C C C C C C C C C C C C C C C H H H H H H H H H H H H H H H H H H H H H H H H H H
charge: 0
multiplicity: 1
keywords: wb97x-d3
keywords: def2-TZVPP
keywords: def2/J RIJCOSX
keywords: DEFGRID2
keywords: scfconv7
keywords: smallprint printgap noloewdin
keywords: NOSOSCF
formula: C22H26O3
InChI: InChI=1/C22H26O3/c1-15(2)10-19-20(22(19,3)4)21(23)25-14-17-12-18(24-13-17)11-16-8-6-5-7-9-16/h5-10,12-13,19-20H,11,14H2,1-4H3
51 atoms
O  2.075863 1.880858 -1.0156
O  2.585571 1.165796 1.039929
O  -1.680489 1.795816 1.226203
C  4.179913 -1.109381 -0.297471
C  2.762875 -1.560631 -0.393421
C  3.157051 -0.158666 -0.876233
C  4.830356 -0.859266 1.041501
C  5.144136 -1.685651 -1.31025
C  1.889363 -1.748025 0.790816
C  2.60529 1.003256 -0.151942
C  0.556764 -1.705797 0.756067
C  -0.265255 -1.910004 1.99111
C  -0.229598 -1.417946 -0.484498
C  1.354024 2.977383 -0.449554
C  -0.007498 2.564709 -0.010775
C  -1.187445 2.478187 -0.816104
C  -0.377049 2.130759 1.21746
C  -2.170446 2.0064 -0.014795
C  -3.589131 1.635956 -0.26309
C  -3.778326 0.138999 -0.336756
C  -3.951073 -0.61388 0.81943
C  -3.738928 -0.516358 -1.562168
C  -4.085254 -1.992502 0.751725
C  -3.877756 -1.89396 -1.634652
C  -4.050783 -2.636916 -0.476238
H  2.551374 -2.235802 -1.218603
H  3.185857 -0.028782 -1.952074
H  5.644522 -0.139966 0.938204
H  4.149479 -0.473465 1.792939
H  5.261793 -1.790429 1.41452
H  5.98201 -1.007873 -1.482611
H  5.55075 -2.634364 -0.954984
H  4.665321 -1.872573 -2.272542
H  2.376681 -1.935276 1.741594
H  -0.946974 -2.756203 1.874155
H  -0.891992 -1.035549 2.183381
H  0.351415 -2.088121 2.871333
H  -0.770459 -0.474435 -0.382102
H  -0.990741 -2.18286 -0.654657
H  0.387349 -1.343426 -1.377874
H  1.291228 3.712631 -1.251125
H  1.914389 3.422898 0.373245
H  -1.281102 2.730748 -1.860505
H  0.169995 1.999548 2.135983
H  -3.899377 2.097439 -1.201892
H  -4.229858 2.058037 0.516282
H  -3.98032 -0.118891 1.782522
H  -3.598422 0.057136 -2.470888
H  -4.220111 -2.563995 1.660809
H  -3.851644 -2.387688 -2.597318
H  -4.161393 -3.71195 -0.53034
totalener: -1079.72918089 hartree
nucrepener: 2249.40498019 hartree
electener: -3329.13416109 hartree
oneelecener: -5937.52423580 hartree
twoeener: 2608.39007471 hartree
kineticenergy: 1074.91694267 hartree
xcener: -106.471161478256 hartree
chargesum: -0.0000000
charge: -0.268388 -0.396991 -0.255918 0.144607 -0.059190 -0.104209 -0.277375 -0.245341 -0.158266 0.360740 0.021828 -0.232892 -0.238726 0.057853 -0.075919 -0.247517 0.004802 0.192976 -0.136210 0.082618 -0.154099 -0.152949 -0.133157 -0.128718 -0.131163 0.087966 0.077776 0.084908 0.101767 0.085895 0.090012 0.087278 0.069688 0.080967 0.084187 0.077240 0.085625 0.054493 0.096455 0.087203 0.099002 0.111670 0.122579 0.148664 0.097256 0.110225 0.113771 0.102327 0.125609 0.123309 0.125731
qa: -0.2684 -0.3970 -0.2559 0.1446 -0.0592 -0.1042 -0.2774 -0.2453 -0.1583 0.3607 0.0218 -0.2329 -0.2387 0.0579 -0.0759 -0.2475 0.0048 0.1930 -0.1362 0.0826 -0.1541 -0.1529 -0.1332 -0.1287 -0.1312 0.0880 0.0778 0.0849 0.1018 0.0859 0.0900 0.0873 0.0697 0.0810 0.0842 0.0772 0.0856 0.0545 0.0965 0.0872 0.0990 0.1117 0.1226 0.1487 0.0973 0.1102 0.1138 0.1023 0.1256 0.1233 0.1257
va: 2.1208 2.0870 2.2938 3.7396 3.8928 3.8444 3.9058 3.9020 3.8543 4.1617 3.7068 3.9487 3.9729 3.8882 3.6854 4.0061 3.9305 3.6261 3.8702 3.5753 3.9464 3.9672 3.9149 3.9448 3.9167 1.0061 1.0324 1.0047 1.0222 0.9980 1.0050 1.0049 1.0070 1.0135 1.0006 1.0038 1.0146 0.9932 1.0038 1.0171 0.9935 1.0106 1.0176 1.0164 1.0130 1.0080 1.0163 1.0128 1.0006 1.0009 0.9998
dispcorr: -0.030012215 hartree
energy: -1079.759193108914
dipole: 10.01315 -10.41325 -0.40010 -14.02008 13.97979 -0.04029 -0.74163 0.05395 -0.68768
magnitude: 0.79663 au
magnitude: 2.02486 debye
