program: Orca
programVersion: 5.0.2
elementType: O O O C C C C C C C C C C C C C C C C C C C C C C H H H H H H H H H H H H H H H H H H H H H H H H H H
charge: 0
multiplicity: 1
keywords: wb97x-d3
keywords: def2-TZVPP
keywords: def2/J RIJCOSX
keywords: DEFGRID2
keywords: scfconv7
keywords: smallprint printgap noloewdin
keywords: NOSOSCF
formula: C22H26O3
InChI: InChI=1/C22H26O3/c1-15(2)10-19-20(22(19,3)4)21(23)25-14-17-12-18(24-13-17)11-16-8-6-5-7-9-16/h5-10,12-13,19-20H,11,14H2,1-4H3
51 atoms
O  2.046167 2.217014 -0.117209
O  1.552653 0.604391 1.353624
O  -2.026605 3.67801 -0.927091
C  3.690673 -1.051907 -0.204541
C  2.384842 -1.350025 -0.870894
C  2.795734 0.094443 -0.634224
C  3.878506 -1.387158 1.253289
C  4.94714 -1.226122 -1.025159
C  1.244909 -1.991622 -0.163974
C  2.070669 0.954789 0.324662
C  1.170241 -3.299973 0.08408
C  -0.017258 -3.895149 0.778264
C  2.240759 -4.278199 -0.293411
C  1.251583 3.160716 0.608552
C  -0.159837 3.133264 0.141289
C  -1.140742 2.114689 0.366844
C  -0.763539 4.049022 -0.651273
C  -2.24823 2.495835 -0.310738
C  -3.592455 1.878169 -0.483188
C  -3.582382 0.410852 -0.14567
C  -2.828769 -0.477347 -0.909627
C  -4.313004 -0.084938 0.925441
C  -2.811869 -1.829042 -0.611168
C  -4.300999 -1.440644 1.227528
C  -3.550722 -2.315571 0.45986
H  2.463613 -1.626107 -1.920227
H  3.125305 0.627562 -1.518175
H  2.966135 -1.296366 1.833662
H  4.231762 -2.416196 1.345749
H  4.633593 -0.738806 1.70167
H  5.306516 -2.255597 -0.963277
H  4.784135 -0.996549 -2.07906
H  5.745694 -0.575756 -0.663746
H  0.41759 -1.362825 0.143826
H  -0.745054 -3.137132 1.063055
H  0.28618 -4.426876 1.683598
H  -0.520781 -4.628633 0.142497
H  3.092612 -3.810836 -0.783863
H  1.846618 -5.044284 -0.96655
H  2.611416 -4.805531 0.589183
H  1.702363 4.131181 0.403621
H  1.319353 2.973637 1.680691
H  -1.024231 1.217955 0.9520
H  -0.424258 4.976796 -1.083916
H  -3.922609 2.019214 -1.517158
H  -4.32881 2.396558 0.139087
H  -2.242593 -0.103603 -1.740566
H  -4.898226 0.594417 1.533601
H  -2.214979 -2.503962 -1.210702
H  -4.876941 -1.809691 2.065955
H  -3.537292 -3.372154 0.69374
totalener: -1079.72852999 hartree
nucrepener: 2190.88398978 hartree
electener: -3270.61251977 hartree
oneelecener: -5820.29992389 hartree
twoeener: 2549.68740412 hartree
kineticenergy: 1074.91144480 hartree
xcener: -106.469544556279 hartree
chargesum: -0.0000000
charge: -0.264780 -0.399926 -0.255842 0.071067 -0.031626 -0.058715 -0.259514 -0.243095 -0.148580 0.335643 -0.040774 -0.239243 -0.256358 0.063764 -0.086401 -0.235710 -0.037489 0.181692 -0.068655 0.030485 -0.180384 -0.133257 -0.137126 -0.116624 -0.142443 0.098773 0.083397 0.115565 0.078883 0.090648 0.082314 0.073417 0.093309 0.088072 0.087769 0.092899 0.086023 0.078410 0.095716 0.090126 0.093343 0.113639 0.167195 0.134028 0.105341 0.084767 0.120370 0.106099 0.137095 0.124336 0.132358
qa: -0.2648 -0.3999 -0.2558 0.0711 -0.0316 -0.0587 -0.2595 -0.2431 -0.1486 0.3356 -0.0408 -0.2392 -0.2564 0.0638 -0.0864 -0.2357 -0.0375 0.1817 -0.0687 0.0305 -0.1804 -0.1333 -0.1371 -0.1166 -0.1424 0.0988 0.0834 0.1156 0.0789 0.0906 0.0823 0.0734 0.0933 0.0881 0.0878 0.0929 0.0860 0.0784 0.0957 0.0901 0.0933 0.1136 0.1672 0.1340 0.1053 0.0848 0.1204 0.1061 0.1371 0.1243 0.1324
va: 2.1316 2.0798 2.3047 3.7170 3.8516 3.8744 3.9082 3.9035 3.8593 4.1714 3.7396 3.9445 3.9403 3.8961 3.7739 3.9711 3.9952 3.6609 3.8403 3.6620 3.9664 3.9777 3.9002 3.9750 3.9206 1.0032 1.0313 1.0167 0.9997 1.0049 1.0058 1.0078 1.0052 1.0125 1.0070 1.0040 0.9932 1.0095 1.0035 0.9985 0.9964 1.0091 1.0089 1.0084 1.0059 1.0085 1.0075 1.0113 0.9926 1.0002 0.9964
dispcorr: -0.026794105 hartree
energy: -1079.755324097767
dipole: 15.02999 -14.83442 0.19557 -24.39458 24.26490 -0.12968 1.08297 -1.47370 -0.39073
magnitude: 0.45578 au
magnitude: 1.15850 debye
