program: Orca
programVersion: 5.0.2
elementType: O O O C C C C C C C C C C C C C C C C C C C C C C H H H H H H H H H H H H H H H H H H H H H H H H H H
charge: 0
multiplicity: 1
keywords: wb97x-d3
keywords: def2-TZVPP
keywords: def2/J RIJCOSX
keywords: DEFGRID2
keywords: scfconv7
keywords: smallprint printgap noloewdin
keywords: NOSOSCF
formula: C22H26O3
InChI: InChI=1/C22H26O3/c1-15(2)10-19-20(22(19,3)4)21(23)25-14-17-12-18(24-13-17)11-16-8-6-5-7-9-16/h5-10,12-13,19-20H,11,14H2,1-4H3
51 atoms
O  1.726407 -2.196023 0.029111
O  1.15388 -1.259395 -1.92213
O  -2.3006 -2.752335 1.501126
C  1.788082 1.290805 -0.135882
C  2.805182 1.130124 -1.229273
C  2.485444 -0.046032 -0.344414
C  2.166948 2.044319 1.114185
C  0.334961 1.452665 -0.509205
C  4.154356 1.739254 -1.140503
C  1.724653 -1.200536 -0.85556
C  4.579965 2.791408 -1.844914
C  5.973189 3.319514 -1.684242
C  3.734171 3.535164 -2.831393
C  0.875152 -3.333941 -0.209042
C  -0.520059 -3.025808 0.201762
C  -1.551713 -2.371742 -0.548981
C  -1.039233 -3.230507 1.434859
C  -2.606636 -2.228298 0.285169
C  -3.918801 -1.547889 0.145711
C  -3.898856 -0.205245 0.83789
C  -4.371993 -0.062604 2.137942
C  -3.347326 0.901442 0.197623
C  -4.299837 1.164628 2.7851
C  -3.275569 2.128542 0.840384
C  -3.752667 2.263549 2.1382
H  2.377027 1.078015 -2.225711
H  3.217873 -0.293127 0.4169
H  1.530254 1.748055 1.94946
H  2.035981 3.117777 0.964562
H  3.201345 1.874384 1.410115
H  0.091071 1.030135 -1.481625
H  0.081831 2.5139 -0.544178
H  -0.314016 0.986457 0.234843
H  4.844286 1.284184 -0.435498
H  5.961256 4.360537 -1.352085
H  6.551599 2.742262 -0.963528
H  6.510058 3.306531 -2.636061
H  3.664464 4.589217 -2.552219
H  4.185561 3.512167 -3.82612
H  2.720455 3.148474 -2.913287
H  1.292548 -4.125049 0.410959
H  0.937514 -3.65216 -1.249504
H  -1.513011 -2.050591 -1.577016
H  -0.642108 -3.691245 2.32594
H  -4.718343 -2.171112 0.552381
H  -4.120915 -1.419333 -0.918087
H  -4.803576 -0.91523 2.648256
H  -2.968196 0.800756 -0.812891
H  -4.673049 1.261572 3.796282
H  -2.846359 2.979757 0.327826
H  -3.6983 3.219929 2.641454
elementType: O C H
totalener: -1079.73986495 hartree
nucrepener: 2142.20014735 hartree
electener: -3221.94001230 hartree
oneelecener: -5723.95592818 hartree
twoeener: 2502.01591587 hartree
cpcmener: -0.02966741 hartree
kineticenergy: 1074.87770481 hartree
xcener: -106.464755817312 hartree
chargesum: 0.0000000
charge: -0.285474 -0.497129 -0.283671 0.180819 0.001532 -0.136764 -0.269761 -0.330287 -0.281688 0.428080 -0.034448 -0.228269 -0.251901 0.069473 -0.062540 -0.352020 -0.034398 0.217172 -0.046800 0.088742 -0.205395 -0.259806 -0.155266 -0.153034 -0.174696 0.095605 0.093820 0.099337 0.096486 0.092180 0.098003 0.103077 0.106194 0.124252 0.094176 0.089523 0.094951 0.096122 0.098001 0.088625 0.121674 0.120847 0.160137 0.178007 0.112472 0.113894 0.142366 0.153404 0.160120 0.163282 0.160972
qa: -0.2855 -0.4971 -0.2837 0.1808 0.0015 -0.1368 -0.2698 -0.3303 -0.2817 0.4281 -0.0344 -0.2283 -0.2519 0.0695 -0.0625 -0.3520 -0.0344 0.2172 -0.0468 0.0887 -0.2054 -0.2598 -0.1553 -0.1530 -0.1747 0.0956 0.0938 0.0993 0.0965 0.0922 0.0980 0.1031 0.1062 0.1243 0.0942 0.0895 0.0950 0.0961 0.0980 0.0886 0.1217 0.1208 0.1601 0.1780 0.1125 0.1139 0.1424 0.1534 0.1601 0.1633 0.1610
va: 2.1199 2.0051 2.2683 3.6477 3.7828 3.8888 3.8982 3.9094 3.8725 4.1630 3.7063 3.9253 3.9437 3.8431 3.6423 3.9763 3.9673 3.6200 3.8107 3.5239 3.9617 3.9172 3.8882 3.8635 3.9022 1.0259 1.0380 1.0029 1.0027 1.0027 1.0161 1.0025 0.9887 1.0067 0.9963 1.0079 0.9953 0.9973 0.9977 1.0084 0.9970 1.0074 1.0187 0.9927 1.0100 1.0089 1.0059 0.9970 0.9894 0.9879 0.9891
dispcorr: -0.025083414 hartree
energy: -1079.764948365528
dipole: 17.39974 -17.19399 0.20575 23.27396 -22.88991 0.38404 -5.26117 5.94366 0.68250
magnitude: 0.80971 au
magnitude: 2.05811 debye
