program: Orca
programVersion: 5.0.2
elementType: O O O C C C C C C C C C C C C C C C C C C C C C C H H H H H H H H H H H H H H H H H H H H H H H H H H
charge: 0
multiplicity: 1
keywords: wb97x-d3
keywords: def2-TZVPP
keywords: def2/J RIJCOSX
keywords: DEFGRID2
keywords: scfconv7
keywords: smallprint printgap noloewdin
keywords: NOSOSCF
formula: C22H26O3
InChI: InChI=1/C22H26O3/c1-15(2)10-19-20(22(19,3)4)21(23)25-14-17-12-18(24-13-17)11-16-8-6-5-7-9-16/h5-10,12-13,19-20H,11,14H2,1-4H3
51 atoms
O  1.693023 -2.08434 -0.191372
O  0.893375 -1.004177 -1.981342
O  -2.173246 -2.835261 1.614069
C  1.733525 1.432201 -0.142521
C  2.647002 1.323153 -1.329114
C  2.390097 0.101077 -0.474066
C  2.21405 2.109468 1.11787
C  0.256067 1.631622 -0.380826
C  4.001345 1.909765 -1.351931
C  1.584749 -1.021787 -0.986906
C  4.530805 2.573675 -2.383862
C  5.925175 3.117246 -2.321424
C  3.78662 2.815868 -3.671022
C  0.833959 -3.216686 -0.42706
C  -0.519678 -2.968798 0.136758
C  -1.630985 -2.290426 -0.464389
C  -0.915334 -3.276813 1.394013
C  -2.603489 -2.233946 0.474112
C  -3.932568 -1.571936 0.511403
C  -3.842616 -0.248463 1.234336
C  -3.398569 0.886015 0.559285
C  -4.138835 -0.150886 2.589847
C  -3.255511 2.094942 1.224551
C  -3.994608 1.058008 3.259362
C  -3.551887 2.183996 2.579084
H  2.131222 1.317056 -2.284055
H  3.183902 -0.188791 0.205739
H  1.615555 1.786706 1.97176
H  2.107985 3.192808 1.032816
H  3.256301 1.893653 1.348198
H  -0.080962 1.262968 -1.347342
H  0.020089 2.696783 -0.340301
H  -0.333177 1.137856 0.394692
H  4.607809 1.773142 -0.461604
H  6.544438 2.698291 -3.119112
H  5.930952 4.200582 -2.467048
H  6.410432 2.901642 -1.369569
H  3.594945 1.885956 -4.210354
H  2.819972 3.29329 -3.505606
H  4.356042 3.4608 -4.339458
H  1.320116 -4.041814 0.090324
H  0.798593 -3.459663 -1.48909
H  -1.697013 -1.895032 -1.464925
H  -0.427474 -3.789815 2.208397
H  -4.668491 -2.219236 0.993479
H  -4.263917 -1.416771 -0.516018
H  -3.156492 0.820773 -0.495431
H  -4.487048 -1.025058 3.127076
H  -2.909789 2.967531 0.685175
H  -4.229693 1.119816 4.314048
H  -3.440323 3.126091 3.099729
elementType: O C H
totalener: -1079.73907295 hartree
nucrepener: 2139.05770893 hartree
electener: -3218.79678188 hartree
oneelecener: -5717.73966763 hartree
twoeener: 2498.94288575 hartree
cpcmener: -0.02961866 hartree
kineticenergy: 1074.85447910 hartree
xcener: -106.460583245723 hartree
chargesum: -0.0000000
charge: -0.285425 -0.500064 -0.283403 0.130976 0.040415 -0.101953 -0.278043 -0.304694 -0.313002 0.422908 -0.011454 -0.223913 -0.284924 0.070665 -0.065593 -0.347851 -0.036422 0.219267 -0.049088 0.087253 -0.252816 -0.209121 -0.157004 -0.152750 -0.175183 0.092164 0.091329 0.098524 0.097999 0.090616 0.095546 0.102894 0.100944 0.120510 0.098706 0.096437 0.085730 0.103786 0.103466 0.095886 0.120859 0.121136 0.160277 0.178498 0.112209 0.113878 0.150672 0.143421 0.164835 0.159996 0.160903
qa: -0.2854 -0.5001 -0.2834 0.1310 0.0404 -0.1020 -0.2780 -0.3047 -0.3130 0.4229 -0.0115 -0.2239 -0.2849 0.0707 -0.0656 -0.3479 -0.0364 0.2193 -0.0491 0.0873 -0.2528 -0.2091 -0.1570 -0.1527 -0.1752 0.0922 0.0913 0.0985 0.0980 0.0906 0.0955 0.1029 0.1009 0.1205 0.0987 0.0964 0.0857 0.1038 0.1035 0.0959 0.1209 0.1211 0.1603 0.1785 0.1122 0.1139 0.1507 0.1434 0.1648 0.1600 0.1609
va: 2.1202 2.0000 2.2682 3.6769 3.7807 3.8462 3.9065 3.9104 3.8994 4.1604 3.6912 3.9199 3.9403 3.8433 3.6432 3.9789 3.9672 3.6194 3.8128 3.5275 3.9140 3.9620 3.8578 3.8874 3.8995 1.0275 1.0357 1.0016 1.0014 1.0063 1.0172 1.0014 0.9913 1.0095 0.9924 0.9929 1.0100 0.9960 0.9958 1.0044 0.9973 1.0068 1.0189 0.9925 1.0111 1.0091 0.9996 1.0057 0.9869 0.9895 0.9892
dispcorr: -0.024649022 hartree
energy: -1079.763721972868
dipole: 17.60579 -17.28890 0.31689 21.66530 -21.47264 0.19266 -7.22800 7.81775 0.58974
magnitude: 0.69666 au
magnitude: 1.77077 debye
