program: Orca
programVersion: 5.0.2
elementType: O O O C C C C C C C C C C C C C C C C C C C C C C H H H H H H H H H H H H H H H H H H H H H H H H H H
charge: 0
multiplicity: 1
keywords: wb97x-d3
keywords: def2-TZVPP
keywords: def2/J RIJCOSX
keywords: DEFGRID2
keywords: scfconv7
keywords: smallprint printgap noloewdin
keywords: NOSOSCF
formula: C22H26O3
InChI: InChI=1/C22H26O3/c1-15(2)10-19-20(22(19,3)4)21(23)25-14-17-12-18(24-13-17)11-16-8-6-5-7-9-16/h5-10,12-13,19-20H,11,14H2,1-4H3
51 atoms
O  1.773374 -2.109331 -0.268969
O  1.742789 -0.385427 1.154998
O  -2.32695 -1.168275 -0.62197
C  4.512146 0.23579 -0.22713
C  3.451378 1.140287 -0.772774
C  3.210295 -0.359118 -0.739761
C  5.738857 -0.067436 -1.053757
C  4.803345 0.282183 1.252913
C  3.555801 1.811379 -2.082786
C  2.184317 -0.911746 0.159215
C  3.20536 3.072268 -2.358216
C  3.338688 3.618558 -3.748126
C  2.650039 4.044287 -1.361861
C  0.777031 -2.79135 0.489867
C  -0.591216 -2.268062 0.223427
C  -1.786141 -2.69117 0.890661
C  -0.980609 -1.345756 -0.684434
C  -2.8065 -1.995674 0.337321
C  -4.266647 -1.964558 0.604821
C  -4.721574 -0.616056 1.107726
C  -4.418371 -0.213914 2.406499
C  -5.423905 0.254301 0.282069
C  -4.813747 1.031453 2.871282
C  -5.821215 1.503141 0.744513
C  -5.516993 1.895161 2.039983
H  2.907905 1.685826 -0.009018
H  3.296544 -0.875599 -1.689199
H  6.471283 0.736409 -0.956499
H  5.519829 -0.192313 -2.113235
H  6.211192 -0.987733 -0.705842
H  5.104327 -0.699144 1.624907
H  3.959924 0.625406 1.847656
H  5.630996 0.969789 1.437071
H  3.940034 1.206034 -2.898743
H  3.697072 2.869884 -4.454244
H  2.380331 3.996361 -4.113603
H  4.030992 4.464162 -3.77141
H  3.185902 4.994414 -1.417354
H  1.604469 4.269462 -1.586947
H  2.699325 3.698884 -0.331234
H  1.006067 -2.755158 1.557198
H  0.85165 -3.834402 0.181049
H  -1.867926 -3.419839 1.68199
H  -0.454269 -0.750745 -1.414192
H  -4.483692 -2.737212 1.343943
H  -4.82059 -2.228351 -0.300179
H  -3.869145 -0.882993 3.059058
H  -5.66771 -0.047854 -0.729479
H  -4.574487 1.328564 3.884216
H  -6.36928 2.169046 0.09049
H  -5.826372 2.866939 2.401967
elementType: O C H
totalener: -1079.74108030 hartree
nucrepener: 2055.73411088 hartree
electener: -3135.47519118 hartree
oneelecener: -5551.17471783 hartree
twoeener: 2415.69952666 hartree
cpcmener: -0.03371453 hartree
kineticenergy: 1074.85118444 hartree
xcener: -106.463173505892 hartree
chargesum: -0.0000000
charge: -0.297010 -0.495944 -0.293540 0.094094 0.052247 -0.088039 -0.271552 -0.276380 -0.291470 0.401062 -0.044559 -0.218399 -0.257842 0.110358 -0.039518 -0.349136 -0.056090 0.202033 -0.047149 0.032754 -0.196374 -0.186319 -0.162173 -0.161292 -0.171998 0.090570 0.089046 0.098026 0.089670 0.098160 0.100195 0.091185 0.096687 0.121834 0.088585 0.092988 0.094759 0.093982 0.100535 0.092032 0.116024 0.126479 0.163579 0.172584 0.117327 0.109466 0.145580 0.142439 0.160072 0.159648 0.160785
qa: -0.2970 -0.4959 -0.2935 0.0941 0.0522 -0.0880 -0.2716 -0.2764 -0.2915 0.4011 -0.0446 -0.2184 -0.2578 0.1104 -0.0395 -0.3491 -0.0561 0.2020 -0.0471 0.0328 -0.1964 -0.1863 -0.1622 -0.1613 -0.1720 0.0906 0.0890 0.0980 0.0897 0.0982 0.1002 0.0912 0.0967 0.1218 0.0886 0.0930 0.0948 0.0940 0.1005 0.0920 0.1160 0.1265 0.1636 0.1726 0.1173 0.1095 0.1456 0.1424 0.1601 0.1596 0.1608
va: 2.1194 1.9966 2.2579 3.7100 3.7606 3.8322 3.9101 3.9027 3.8846 4.1449 3.7552 3.9206 3.9418 3.8090 3.6222 4.0060 3.9468 3.6323 3.8097 3.5933 3.9328 3.9406 3.8986 3.8910 3.8899 1.0331 1.0365 1.0014 1.0062 1.0014 0.9992 1.0187 0.9999 1.0104 1.0089 0.9955 0.9962 0.9977 0.9955 1.0087 1.0112 0.9922 1.0047 0.9970 1.0064 1.0056 1.0026 1.0039 0.9902 0.9902 0.9894
dispcorr: -0.021642573 hartree
energy: -1079.762722871541
dipole: 23.12754 -22.67441 0.45313 15.25270 -15.89479 -0.64209 -7.01997 6.49098 -0.52900
magnitude: 0.94733 au
magnitude: 2.40793 debye
