program: Orca
programVersion: 5.0.2
elementType: O O O C C C C C C C C C C C C C C C C C C C C C C H H H H H H H H H H H H H H H H H H H H H H H H H H
charge: 0
multiplicity: 1
keywords: wb97x-d3
keywords: def2-TZVPP
keywords: def2/J RIJCOSX
keywords: DEFGRID2
keywords: scfconv7
keywords: smallprint printgap noloewdin
keywords: NOSOSCF
formula: C22H26O3
InChI: InChI=1/C22H26O3/c1-15(2)10-19-20(22(19,3)4)21(23)25-14-17-12-18(24-13-17)11-16-8-6-5-7-9-16/h5-10,12-13,19-20H,11,14H2,1-4H3
51 atoms
O  2.1428 -2.045547 0.201355
O  1.685281 -1.811107 -1.971418
O  -1.959276 -1.725129 1.394233
C  3.99638 0.386492 -0.057814
C  2.64336 0.800649 0.40111
C  2.78665 -0.043332 -0.869716
C  4.883585 1.398185 -0.744526
C  4.779959 -0.606477 0.766819
C  2.09238 2.17072 0.314526
C  2.172262 -1.377178 -0.948183
C  0.807036 2.438363 0.567709
C  0.258126 3.82827 0.492759
C  -0.167219 1.348675 0.926096
C  1.230083 -3.15335 0.322496
C  -0.161799 -2.648749 0.474049
C  -1.138995 -2.407185 -0.54606
C  -0.721657 -2.212385 1.626443
C  -2.208751 -1.848973 0.06559
C  -3.501869 -1.321316 -0.439866
C  -3.525616 0.188534 -0.429835
C  -4.072852 0.886794 0.641327
C  -2.954211 0.904364 -1.479014
C  -4.055047 2.276107 0.662586
C  -2.936635 2.291339 -1.461881
C  -3.487661 2.981704 -0.389078
H  2.270144 0.227431 1.244842
H  2.665925 0.497784 -1.80117
H  5.630687 0.893331 -1.35919
H  5.415829 2.002459 -0.007433
H  4.329811 2.075595 -1.394318
H  5.456999 -0.068006 1.433294
H  5.390471 -1.248554 0.128766
H  4.153302 -1.241748 1.388194
H  2.760565 2.980789 0.039319
H  -0.526797 3.895666 -0.26531
H  -0.205766 4.118655 1.438957
H  1.026251 4.562546 0.250939
H  -1.175655 1.739532 1.059024
H  -0.208085 0.578882 0.151074
H  0.111227 0.845428 1.855305
H  1.555795 -3.677032 1.219391
H  1.328877 -3.835457 -0.521166
H  -1.054238 -2.626073 -1.598214
H  -0.368767 -2.191247 2.645384
H  -4.328763 -1.71317 0.157505
H  -3.63883 -1.69124 -1.456755
H  -4.52144 0.341512 1.463165
H  -2.519389 0.369866 -2.315711
H  -4.486324 2.806804 1.501587
H  -2.49299 2.834765 -2.286262
H  -3.475047 4.06373 -0.374546
elementType: O C H
totalener: -1079.73608028 hartree
nucrepener: 2244.56593482 hartree
electener: -3324.30201510 hartree
oneelecener: -5928.61703569 hartree
twoeener: 2604.31502060 hartree
cpcmener: -0.02990583 hartree
kineticenergy: 1074.87113536 hartree
xcener: -106.467010592735 hartree
chargesum: 0.0000000
charge: -0.282949 -0.504606 -0.279139 0.155114 -0.011663 -0.070622 -0.295309 -0.268888 -0.330164 0.393496 0.058424 -0.231145 -0.334613 0.062400 -0.071694 -0.281960 -0.044896 0.168724 -0.047499 0.064663 -0.200319 -0.223866 -0.126592 -0.136331 -0.213222 0.098395 0.089293 0.100377 0.102502 0.088423 0.093456 0.100815 0.091801 0.126801 0.093091 0.102408 0.093589 0.090073 0.094220 0.119892 0.117494 0.122068 0.159203 0.177175 0.113816 0.114441 0.140711 0.141856 0.157896 0.160541 0.162318
qa: -0.2829 -0.5046 -0.2791 0.1551 -0.0117 -0.0706 -0.2953 -0.2689 -0.3302 0.3935 0.0584 -0.2311 -0.3346 0.0624 -0.0717 -0.2820 -0.0449 0.1687 -0.0475 0.0647 -0.2003 -0.2239 -0.1266 -0.1363 -0.2132 0.0984 0.0893 0.1004 0.1025 0.0884 0.0935 0.1008 0.0918 0.1268 0.0931 0.1024 0.0936 0.0901 0.0942 0.1199 0.1175 0.1221 0.1592 0.1772 0.1138 0.1144 0.1407 0.1419 0.1579 0.1605 0.1623
va: 2.1006 1.9918 2.2535 3.7613 3.7578 3.8180 3.9183 3.8716 3.8852 4.1573 3.6328 3.9095 3.9894 3.8450 3.6268 3.9764 3.9158 3.6634 3.7994 3.5342 3.9426 3.8948 3.8462 3.8078 3.8587 1.0254 1.0305 1.0013 0.9987 1.0024 1.0006 1.0002 1.0147 1.0071 0.9957 0.9935 1.0111 1.0163 0.9874 1.0013 1.0005 1.0059 1.0167 0.9939 1.0081 1.0095 1.0069 1.0049 0.9902 0.9890 0.9894
dispcorr: -0.029694139 hartree
energy: -1079.765774418771
dipole: 12.04682 -12.01423 0.03259 15.23369 -14.88250 0.35119 2.76633 -1.65587 1.11046
magnitude: 1.16513 au
magnitude: 2.96152 debye
