program: Orca
programVersion: 5.0.2
elementType: O O O C C C C C C C C C C C C C C C C C C C C C C H H H H H H H H H H H H H H H H H H H H H H H H H H
charge: 0
multiplicity: 1
keywords: wb97x-d3
keywords: def2-TZVPP
keywords: def2/J RIJCOSX
keywords: DEFGRID2
keywords: scfconv7
keywords: smallprint printgap noloewdin
keywords: NOSOSCF
formula: C22H26O3
InChI: InChI=1/C22H26O3/c1-15(2)10-19-20(22(19,3)4)21(23)25-14-17-12-18(24-13-17)11-16-8-6-5-7-9-16/h5-10,12-13,19-20H,11,14H2,1-4H3
51 atoms
O  1.637247 -1.854576 -0.005267
O  1.732988 0.049259 1.16628
O  -2.765954 -1.918626 -0.585536
C  4.498374 0.311524 -0.318827
C  3.476635 1.188276 -0.973306
C  3.153659 -0.267616 -0.734979
C  5.682116 -0.148293 -1.133148
C  4.828971 0.542714 1.13411
C  3.624639 1.68023 -2.36569
C  2.116785 -0.637125 0.24468
C  4.080287 2.890849 -2.697805
C  4.184713 3.319891 -4.12904
C  4.524086 3.909766 -1.694035
C  0.576365 -2.364679 0.822188
C  -0.757604 -1.892905 0.364562
C  -1.375424 -0.609771 0.538622
C  -1.651349 -2.637048 -0.327908
C  -2.588443 -0.680238 -0.05647
C  -3.718459 0.280177 -0.159113
C  -4.749244 0.036751 0.917446
C  -4.702324 0.756766 2.107682
C  -5.731438 -0.937648 0.75982
C  -5.617199 0.510318 3.122079
C  -6.646188 -1.188096 1.773686
C  -6.591302 -0.465716 2.958678
H  2.981152 1.871159 -0.288836
H  3.194237 -0.913388 -1.605381
H  6.128063 -1.042225 -0.693231
H  6.450958 0.62699 -1.156384
H  5.416412 -0.381934 -2.163644
H  5.111671 -0.388194 1.628711
H  4.011847 0.988249 1.695991
H  5.679657 1.222541 1.206906
H  3.338973 0.998725 -3.161697
H  3.602001 4.226485 -4.31039
H  5.218079 3.561359 -4.390157
H  3.833676 2.550643 -4.816422
H  3.908822 4.81088 -1.755777
H  4.488433 3.548688 -0.667672
H  5.549921 4.225471 -1.899158
H  0.757098 -2.116211 1.868596
H  0.643336 -3.447031 0.72121
H  -0.97694 0.251259 1.049487
H  -1.629243 -3.65344 -0.689489
H  -4.178912 0.209983 -1.147391
H  -3.316401 1.289488 -0.065077
H  -3.943348 1.518712 2.24123
H  -5.786444 -1.501872 -0.163621
H  -5.5689 1.081499 4.040208
H  -7.405005 -1.947743 1.636914
H  -7.305591 -0.659843 3.748047
elementType: O C H
totalener: -1079.73980676 hartree
nucrepener: 2038.59845804 hartree
electener: -3118.33826480 hartree
oneelecener: -5516.74034891 hartree
twoeener: 2398.40208411 hartree
cpcmener: -0.02918582 hartree
kineticenergy: 1074.86354254 hartree
xcener: -106.461209653625 hartree
chargesum: -0.0000000
charge: -0.290316 -0.509844 -0.285438 0.143238 -0.010316 -0.117401 -0.271873 -0.300239 -0.263674 0.445141 -0.037300 -0.229870 -0.250172 0.074968 -0.094575 -0.297641 -0.038701 0.204453 -0.059554 0.049225 -0.201555 -0.203186 -0.151916 -0.157145 -0.179932 0.098589 0.091764 0.099349 0.096344 0.092549 0.103545 0.092655 0.096573 0.124283 0.094710 0.094950 0.089745 0.100980 0.087090 0.096030 0.119960 0.120290 0.162994 0.179161 0.115810 0.109313 0.143890 0.142280 0.160320 0.159651 0.160802
qa: -0.2903 -0.5098 -0.2854 0.1432 -0.0103 -0.1174 -0.2719 -0.3002 -0.2637 0.4451 -0.0373 -0.2299 -0.2502 0.0750 -0.0946 -0.2976 -0.0387 0.2045 -0.0596 0.0492 -0.2016 -0.2032 -0.1519 -0.1571 -0.1799 0.0986 0.0918 0.0993 0.0963 0.0925 0.1035 0.0927 0.0966 0.1243 0.0947 0.0949 0.0897 0.1010 0.0871 0.0960 0.1200 0.1203 0.1630 0.1792 0.1158 0.1093 0.1439 0.1423 0.1603 0.1597 0.1608
va: 2.1221 1.9877 2.2691 3.6586 3.7841 3.8931 3.9085 3.8968 3.8643 4.1151 3.7018 3.9270 3.9406 3.8336 3.6803 4.0074 3.9648 3.6563 3.8128 3.5918 3.9368 3.9526 3.8846 3.8924 3.8971 1.0249 1.0368 1.0029 1.0020 1.0019 0.9989 1.0190 1.0005 1.0065 0.9954 0.9960 1.0075 0.9981 1.0080 0.9976 1.0080 0.9991 1.0183 0.9925 1.0104 1.0102 1.0031 1.0097 0.9895 0.9900 0.9896
dispcorr: -0.022229058 hartree
energy: -1079.762035818278
dipole: 28.38218 -27.78066 0.60153 15.77770 -15.91081 -0.13311 -8.69630 8.01705 -0.67925
magnitude: 0.91702 au
magnitude: 2.33089 debye
