program: Gaussian 09
title: 000069569
version: EM64L-G09RevD.01
frameworkgroup: C1[X(C8H4F3NO4)]
method: RPBEPBE
basis: SDD
operation: Freq
keyword: #p
keyword: freq=noraman
keyword: PBEPBE/SDD
title: #p freq=noraman PBEPBE/SDD
converged: YES YES NO YES
title: Mulliken charges:
elementType: F F F O O O O N C C C C C C C C H H H H
charge: -0.128921 -0.142329 -0.142240 -0.274018 -0.132371 -0.195946 -0.195948 0.026681 0.427190 0.394049 -0.310010 -0.310135 -0.328818 -0.328775 0.161098 0.352242 0.267769 0.267797 0.296340 0.296344
chargesum: 0.00000
title: Mulliken charges with hydrogens summed into heavy atoms:
elementType: F F F O O O O N C C C C C C C C
charge: -0.128921 -0.142329 -0.142240 -0.274018 -0.132371 -0.195946 -0.195948 0.026681 0.427190 0.394049 -0.042240 -0.042338 -0.032477 -0.032431 0.161098 0.352242
polarizability: 1.64418203e+02 2.91507077e-03 1.06041459e+02 2.57569864e+00 1.82604876e-02 6.18975361e+01
1716.lowfreq: -48.2390 -22.1671 -7.0185 -6.8258 -0.0006 -0.0004 0.0004 1.4636 40.2571
frequency: -48.2000 -21.6393 40.2349 45.3515 63.9280 132.5997 169.5517 204.5201 244.4611 264.2083 308.7689 375.7709 386.6152 396.1319 412.4080 451.8271 485.5872 503.5982 509.4546 608.4975 621.8436 648.3388 663.6588 693.4369 716.5163 753.3394 779.9353 813.2628 835.4138 873.5395 982.4524 989.8950 1001.0589 1022.3097 1023.6683 1067.5270 1089.8355 1103.4433 1152.5432 1177.1998 1215.6711 1222.5663 1285.2318 1370.5525 1401.5130 1421.3016 1468.1235 1597.9717 1610.2614 1684.2918 3172.2291 3172.3730 3191.1945 3193.8026
redmass: 8.8972 9.6403 11.6543 12.2650 8.6555 10.4671 13.3988 11.8879 10.9973 14.2196 7.9170 16.6083 10.6824 8.1679 2.9429 16.2659 3.9941 11.3113 6.8044 10.7666 7.2218 8.2764 5.4968 12.9596 5.2542 8.9739 6.1077 7.6961 1.2416 1.8617 1.3458 1.3637 3.0493 13.0913 11.9991 12.2726 3.2239 1.2571 2.0146 1.8587 9.7774 10.5402 1.2593 7.8773 7.3563 5.0105 2.3911 6.5066 8.4737 12.9484 1.0905 1.0903 1.0963 1.0975
irintensity: 0.5953 0.0240 1.1431 1.9911 0.0294 2.1921 2.7718 0.4721 5.5831 3.3172 0.8699 2.1750 7.3880 1.0338 0.0196 8.9321 16.0488 2.1662 0.0170 3.9351 0.2246 29.9289 25.0323 10.3960 6.2162 13.8765 33.7354 10.6999 0.0107 79.3437 6.8176 0.1034 38.3282 222.9225 534.3858 161.2090 9.7808 20.8477 223.2867 23.0365 237.6881 113.8844 2.1493 93.9531 7.5831 41.6391 52.8558 78.6544 7.1555 197.2121 0.6872 0.1237 1.7663 6.1710
temp: 298.150 k
press: 1.00000 atm
elementType: 9 9 9 8 8 8 8 7 6 6 6 6 6 6 6 6 1 1 1 1
symmnumber: 1
zpe: 302773.7 jmol-1
zpe.correction: 0.115320 hartree
zpe.thermalcorrener: 0.127618 hartree
zpe.thermalcorrenthalpy: 0.128563 hartree
zpe.thermalcorrgfe: 0.074940 hartree
zpe.sumelectzpe: -961.162513 hartree
zpe.sumelectthermal: -961.150215 hartree
zpe.sumelectthermalent: -961.149271 hartree
zpe.sumelectthermalfe: -961.202894 hartree
dipole: -1.1821 0.0016 -1.4301
dipole: 1.8555
quadrupole: -125.1084 -81.5922 -94.9046
quadrupole: 0.0032 -0.5760 0.0178
quadrupole: -24.5733 18.9429 5.6304 0.0032 -0.5760 0.0178
hfenergy: -961.2778337 hartree
pointgroup: C01 [X(C8H4F3N1O4)]
dipole: 0.4659224 -0.001059 -0.5619621 debye
dipolederiv: -0.456054 0.0001685 0.1362879 0.0001601 -0.2612387 -0.000323 0.0899237 -0.0002763 -0.8055755 -0.5790647 0.2202059 -0.0711612 0.2054829 -0.6081674 0.15714 -0.0506913 0.1404188 -0.3368023 -0.579954 -0.2207052 -0.0714279 -0.2059278 -0.6075994 -0.1566537 -0.0509206 -0.1400094 -0.3364147 -1.9282146 -0.0011213 -0.4391786 -0.0014155 -0.2296852 -0.001212 -0.4552577 -0.0011272 -0.6630383 -0.5392389 0.0004419 0.1540838 -0.0012172 -0.2208693 -0.0016226 -0.4722363 -0.0016391 -0.8274549 -0.7059627 0.1917637 0.0387931 0.1674554 -0.6568944 -0.0109541 0.0558401 -0.0208851 -0.2244979 -0.7060404 -0.191668 0.0393511 -0.1672854 -0.6567399 0.012191 0.0563365 0.0221301 -0.2245966 1.7456075 -0.0002217 -0.1328606 -0.0003266 1.0888013 -0.0012408 -0.1793485 -0.0012559 0.2099188 1.4238676 0.000424 0.1419616 -0.0004517 0.3342738 -0.0006448 -0.1920697 -0.00062 0.0160038 -0.5930631 0.0001012 0.0459234 0.0001744 0.0229492 0.0000393 0.0706907 0.0000291 0.0517562 -0.3651686 0.1502702 -0.044555 0.2021679 -0.0263061 -0.0238688 0.0197571 -0.0080243 -0.0968417 -0.3652853 -0.1504372 -0.0441642 -0.2019676 -0.0261443 0.0236753 0.0202562 0.0078978 -0.0969551 0.1553477 -0.1115327 -0.0265424 0.1861224 -0.0207394 -0.0033891 -0.029172 0.0135456 -0.0806158 0.1553422 0.1114237 -0.0268573 -0.1862534 -0.0208037 0.0032033 -0.0286778 -0.0136949 -0.0806217 1.4649114 0.0004397 0.2374123 0.0028201 0.1290649 0.0034536 1.1075989 0.0032361 1.3747279 1.5489116 0.0004097 0.0192761 0.0004148 1.5296037 -0.0004642 -0.0051088 -0.0003379 1.4605245 0.0560843 -0.0579339 0.0205016 -0.0687175 0.0349137 0.0017108 0.013871 0.0007988 0.1577301 0.0561701 0.0579821 0.0203285 0.0687453 0.0348979 -0.0013227 0.0136729 -0.0004529 0.1577784 0.1059074 0.050886 0.0013355 0.0157731 0.0803225 -0.0022313 0.00774 -0.0050522 0.1724983 0.1058963 -0.0508967 0.0014924 -0.0157536 0.0803609 0.0025138 0.0077955 0.0053188 0.1724764 unknown
polarizability: 164.4256176|-0.0010769|106.041407|-2.4236463|-0.0512598|61.890174 unknown
InChI: InChI=1S/C8H4F3NO4/c9-8(10,11)7(13)16-6-3-1-5(2-4-6)12(14)15/h1-4H
charge 0 multiplicity 1
20 atoms
F  3.903521 -0.001134 -1.442809
F  4.422812 -1.138268 0.447578
F  4.42536 1.136478 0.446538
O  1.428988 -0.001422 -0.646814
O  1.980562 0.004757 1.641987
O  -4.806137 1.141505 0.161217
O  -4.806384 -1.140478 0.164508
N  -4.209182 0.000348 0.092798
C  0.010216 -0.000834 -0.401244
C  -2.731447 -0.00006 -0.081021
C  -0.658281 1.236042 -0.326908
C  -0.658539 -1.237336 -0.32316
C  -2.057095 1.237592 -0.162683
C  -2.057357 -1.238097 -0.158955
C  2.289368 0.001456 0.445419
C  3.761205 -0.000343 -0.052292
H  -0.09644 2.171236 -0.401493
H  -0.096871 -2.172855 -0.394923
H  -2.626572 2.167911 -0.097927
H  -2.627028 -2.168098 -0.091417
