program: Orca
programVersion: 5.0.2
elementType: O O O C C C C C C C C C C C C C C C C C C C C C C H H H H H H H H H H H H H H H H H H H H H H H H H H
charge: 0
multiplicity: 1
keywords: wb97x-d3
keywords: def2-TZVPP
keywords: def2/J RIJCOSX
keywords: DEFGRID2
keywords: scfconv7
keywords: smallprint printgap noloewdin
keywords: NOSOSCF
formula: C22H26O3
InChI: InChI=1/C22H26O3/c1-15(2)10-19-20(22(19,3)4)21(23)25-14-17-12-18(24-13-17)11-16-8-6-5-7-9-16/h5-10,12-13,19-20H,11,14H2,1-4H3
51 atoms
O  1.910211 -2.155838 -0.267148
O  1.704444 -0.589461 1.317282
O  -2.097282 -1.074154 -0.958505
C  4.438773 0.445904 0.139124
C  3.315223 1.233375 -0.435034
C  3.259313 -0.289574 -0.481439
C  5.730625 0.329374 -0.633467
C  4.647296 0.454533 1.633136
C  3.42261 2.0074 -1.695633
C  2.230935 -0.987734 0.302298
C  2.37938 2.421829 -2.420695
C  2.569159 3.230089 -3.666915
C  0.95629 2.120241 -2.06526
C  0.832745 -2.899383 0.299822
C  -0.487939 -2.288751 -0.023909
C  -1.732293 -2.583282 0.619757
C  -0.771132 -1.369878 -0.975177
C  -2.672979 -1.819506 0.01561
C  -4.120874 -1.61506 0.273401
C  -4.387752 -0.297748 0.964541
C  -3.994184 -0.114127 2.288644
C  -5.006903 0.753312 0.297631
C  -4.217515 1.09273 2.933197
C  -5.231989 1.965207 0.940834
C  -4.838505 2.138408 2.25975
H  2.645926 1.657975 0.308512
H  3.467443 -0.738716 -1.445489
H  6.371114 1.192709 -0.442501
H  5.574534 0.260389 -1.709802
H  6.278261 -0.562209 -0.323571
H  5.077745 -0.488328 1.975222
H  3.733113 0.633589 2.194155
H  5.34912 1.248689 1.894914
H  4.42124 2.265637 -2.035485
H  2.060489 4.194553 -3.590459
H  3.621399 3.419959 -3.877493
H  2.136536 2.721587 -4.532305
H  0.852467 1.500263 -1.176045
H  0.396799 3.043884 -1.895372
H  0.456071 1.607504 -2.890972
H  0.954863 -3.009544 1.379405
H  0.918174 -3.895117 -0.136595
H  -1.897895 -3.269678 1.435392
H  -0.174959 -0.853075 -1.711175
H  -4.468139 -2.439854 0.898027
H  -4.684319 -1.665634 -0.661213
H  -3.508105 -0.924831 2.819399
H  -5.319521 0.624416 -0.731825
H  -3.908285 1.218273 3.96291
H  -5.715401 2.774331 0.408607
H  -5.014016 3.081028 2.761726
elementType: O C H
totalener: -1079.73903649 hartree
nucrepener: 2111.73441302 hartree
electener: -3191.47344951 hartree
oneelecener: -5663.17073998 hartree
twoeener: 2471.69729047 hartree
cpcmener: -0.03236350 hartree
kineticenergy: 1074.84398133 hartree
xcener: -106.461042751233 hartree
chargesum: -0.0000000
charge: -0.297111 -0.497571 -0.293043 0.160961 -0.029652 -0.078253 -0.293564 -0.276440 -0.290037 0.376396 -0.001302 -0.230618 -0.263080 0.117225 -0.044273 -0.347650 -0.067700 0.209170 -0.059061 0.032389 -0.192606 -0.195683 -0.163054 -0.155053 -0.175585 0.101442 0.092783 0.101675 0.091371 0.099663 0.100727 0.090511 0.095736 0.126273 0.095531 0.089831 0.095572 0.076518 0.105802 0.099325 0.115509 0.122266 0.164540 0.192918 0.118237 0.108626 0.146232 0.142947 0.160401 0.159712 0.161045
qa: -0.2971 -0.4976 -0.2930 0.1610 -0.0297 -0.0783 -0.2936 -0.2764 -0.2900 0.3764 -0.0013 -0.2306 -0.2631 0.1172 -0.0443 -0.3477 -0.0677 0.2092 -0.0591 0.0324 -0.1926 -0.1957 -0.1631 -0.1551 -0.1756 0.1014 0.0928 0.1017 0.0914 0.0997 0.1007 0.0905 0.0957 0.1263 0.0955 0.0898 0.0956 0.0765 0.1058 0.0993 0.1155 0.1223 0.1645 0.1929 0.1182 0.1086 0.1462 0.1429 0.1604 0.1597 0.1610
va: 2.1130 1.9895 2.2551 3.7132 3.8242 3.8039 3.9161 3.8823 3.8946 4.1450 3.6820 3.9286 3.9507 3.8054 3.6407 4.0034 3.9388 3.6233 3.8193 3.6061 3.9316 3.9465 3.9040 3.8854 3.8941 1.0241 1.0340 0.9986 1.0009 1.0022 0.9991 1.0192 1.0005 1.0027 0.9956 1.0064 0.9962 1.0114 1.0006 0.9960 1.0110 0.9920 1.0044 0.9829 1.0063 1.0104 1.0025 1.0034 0.9904 0.9900 0.9894
dispcorr: -0.023434830 hartree
energy: -1079.762471324333
dipole: 18.44386 -18.19314 0.25072 12.71721 -13.24891 -0.53170 -6.76238 6.02878 -0.73360
magnitude: 0.94007 au
magnitude: 2.38947 debye
