program: Orca
programVersion: 5.0.2
elementType: O O O C C C C C C C C C C C C C C C C C C C C C C H H H H H H H H H H H H H H H H H H H H H H H H H H
charge: 0
multiplicity: 1
keywords: wb97x-d3
keywords: def2-TZVPP
keywords: def2/J RIJCOSX
keywords: DEFGRID2
keywords: scfconv7
keywords: smallprint printgap noloewdin
keywords: NOSOSCF
formula: C22H26O3
InChI: InChI=1/C22H26O3/c1-15(2)10-19-20(22(19,3)4)21(23)25-14-17-12-18(24-13-17)11-16-8-6-5-7-9-16/h5-10,12-13,19-20H,11,14H2,1-4H3
51 atoms
O  1.458121 -2.098296 -0.657679
O  1.995753 -1.135183 1.288826
O  -2.357043 -2.080111 1.599582
C  4.117584 0.252123 -0.624868
C  3.055536 1.21551 -0.192663
C  2.647282 -0.114092 -0.776644
C  4.858441 0.517814 -1.911114
C  4.970831 -0.404376 0.430368
C  2.763942 2.462557 -0.942216
C  2.01555 -1.136664 0.077619
C  3.186809 3.679237 -0.588619
C  2.826546 4.892907 -1.3898
C  4.044779 3.943039 0.610658
C  0.76975 -3.160873 0.026533
C  -0.608644 -2.758791 0.410893
C  -1.75479 -2.676567 -0.446588
C  -1.039665 -2.380837 1.63653
C  -2.787757 -2.265735 0.323651
C  -4.213564 -1.970292 0.032532
C  -4.520859 -0.49623 0.143918
C  -5.173192 0.016752 1.259731
C  -4.126202 0.378478 -0.865744
C  -5.431567 1.378298 1.364142
C  -4.383977 1.737534 -0.765442
C  -5.038201 2.242266 0.352189
H  2.938189 1.282786 0.884985
H  2.287979 -0.102356 -1.800358
H  4.217294 0.939593 -2.684438
H  5.290629 -0.404232 -2.303646
H  5.677253 1.219532 -1.740234
H  5.299973 -1.395198 0.110832
H  4.464842 -0.508587 1.38785
H  5.865473 0.197959 0.600414
H  2.160797 2.365994 -1.840499
H  2.294135 5.623383 -0.775172
H  3.722388 5.397895 -1.759973
H  2.19722 4.650025 -2.245645
H  3.542416 4.617268 1.308871
H  4.319323 3.040117 1.153575
H  4.969217 4.44451 0.313334
H  1.343126 -3.495346 0.890774
H  0.744564 -3.97604 -0.69443
H  -1.79816 -2.904936 -1.500211
H  -0.547345 -2.293397 2.592419
H  -4.860447 -2.536815 0.707412
H  -4.423544 -2.322809 -0.978255
H  -5.487571 -0.652881 2.051381
H  -3.615878 -0.009793 -1.739723
H  -5.942085 1.762741 2.237773
H  -4.077269 2.403577 -1.561603
H  -5.24133 3.302293 0.431031
elementType: O C H
totalener: -1079.74086408 hartree
nucrepener: 2071.17276406 hartree
electener: -3150.91362814 hartree
oneelecener: -5582.10227628 hartree
twoeener: 2431.18864814 hartree
cpcmener: -0.03102740 hartree
kineticenergy: 1074.85897089 hartree
xcener: -106.460510045719 hartree
chargesum: -0.0000000
charge: -0.290218 -0.505075 -0.286591 0.146620 -0.006715 -0.133315 -0.268922 -0.295280 -0.269551 0.434630 -0.034113 -0.231092 -0.252170 0.092580 -0.086935 -0.332987 -0.015124 0.195664 -0.052030 0.043413 -0.194674 -0.199374 -0.159564 -0.162336 -0.174626 0.094972 0.092928 0.092335 0.098936 0.096743 0.101860 0.091873 0.096466 0.124592 0.095232 0.094649 0.089885 0.099715 0.088272 0.096799 0.120275 0.123886 0.163944 0.174750 0.110504 0.117680 0.142906 0.146145 0.160080 0.160921 0.161436
qa: -0.2902 -0.5051 -0.2866 0.1466 -0.0067 -0.1333 -0.2689 -0.2953 -0.2696 0.4346 -0.0341 -0.2311 -0.2522 0.0926 -0.0869 -0.3330 -0.0151 0.1957 -0.0520 0.0434 -0.1947 -0.1994 -0.1596 -0.1623 -0.1746 0.0950 0.0929 0.0923 0.0989 0.0967 0.1019 0.0919 0.0965 0.1246 0.0952 0.0946 0.0899 0.0997 0.0883 0.0968 0.1203 0.1239 0.1639 0.1747 0.1105 0.1177 0.1429 0.1461 0.1601 0.1609 0.1614
va: 2.1209 1.9954 2.2694 3.6677 3.7764 3.8878 3.9067 3.9018 3.8678 4.1571 3.7021 3.9268 3.9414 3.8031 3.6195 4.0112 3.9454 3.6317 3.8114 3.5832 3.9466 3.9357 3.8889 3.8985 3.8914 1.0278 1.0370 1.0019 1.0031 1.0023 0.9996 1.0179 1.0009 1.0066 0.9951 0.9961 1.0076 0.9983 1.0078 0.9975 1.0117 0.9940 1.0064 1.0011 1.0072 1.0068 1.0044 1.0023 0.9899 0.9900 0.9893
dispcorr: -0.022185159 hartree
energy: -1079.763049240011
dipole: 23.99335 -23.79935 0.19401 19.28442 -19.33332 -0.04890 -6.97015 5.74141 -1.22873
magnitude: 1.24492 au
magnitude: 3.16432 debye
