program: Orca
programVersion: 5.0.2
elementType: O O O C C C C C C C C C C C C C C C C C C C C C C H H H H H H H H H H H H H H H H H H H H H H H H H H
charge: 0
multiplicity: 1
keywords: wb97x-d3
keywords: def2-TZVPP
keywords: def2/J RIJCOSX
keywords: DEFGRID2
keywords: scfconv7
keywords: smallprint printgap noloewdin
keywords: NOSOSCF
formula: C22H26O3
InChI: InChI=1/C22H26O3/c1-15(2)10-19-20(22(19,3)4)21(23)25-14-17-12-18(24-13-17)11-16-8-6-5-7-9-16/h5-10,12-13,19-20H,11,14H2,1-4H3
51 atoms
O  2.112206 -2.03059 0.0255
O  1.483176 -1.76085 -2.100397
O  -1.87876 -1.759253 1.523887
C  3.957863 0.404042 -0.385066
C  2.671153 0.794352 0.251088
C  2.656389 -0.004298 -1.054986
C  4.749027 1.445893 -1.140266
C  4.841816 -0.613752 0.294074
C  2.11937 2.166864 0.278993
C  2.046216 -1.342513 -1.10971
C  0.863564 2.423582 0.65879
C  0.323492 3.81762 0.715782
C  -0.080147 1.319602 1.053667
C  1.228719 -3.155694 0.199154
C  -0.153711 -2.672494 0.46353
C  -1.207814 -2.432172 -0.477237
C  -0.624684 -2.243569 1.658301
C  -2.228964 -1.878322 0.216033
C  -3.549819 -1.33614 -0.192617
C  -3.541084 0.174413 -0.200043
C  -2.957799 0.863253 -1.261059
C  -4.065271 0.898943 0.864779
C  -2.903769 2.249099 -1.260483
C  -4.012601 2.287963 0.868822
C  -3.431754 2.966273 -0.193218
H  2.402843 0.19215 1.1146
H  2.423318 0.566957 -1.946459
H  5.409043 0.969378 -1.867133
H  5.373533 2.021724 -0.4547
H  4.115306 2.146784 -1.682839
H  4.299154 -1.291714 0.947962
H  5.583039 -0.097944 0.907241
H  5.384678 -1.211291 -0.440511
H  2.766114 2.989645 -0.009515
H  1.069259 4.560909 0.434612
H  -0.537545 3.930519 0.051744
H  -0.033203 4.057567 1.720907
H  0.243587 0.823291 1.972174
H  -1.087889 1.696044 1.228099
H  -0.141257 0.547113 0.283226
H  1.630511 -3.685535 1.060274
H  1.272603 -3.824629 -0.659897
H  -1.203233 -2.646336 -1.533953
H  -0.196859 -2.225016 2.648811
H  -4.335185 -1.704561 0.471784
H  -3.771188 -1.715227 -1.191204
H  -2.540353 0.307832 -2.093158
H  -4.52249 0.374984 1.69575
H  -2.448523 2.771069 -2.09238
H  -4.426583 2.839202 1.703357
H  -3.390116 4.04773 -0.191352
elementType: O C H
totalener: -1079.73595270 hartree
nucrepener: 2245.93254148 hartree
electener: -3325.66849418 hartree
oneelecener: -5931.36519958 hartree
twoeener: 2605.69670540 hartree
cpcmener: -0.02996107 hartree
kineticenergy: 1074.85976601 hartree
xcener: -106.464441828336 hartree
chargesum: 0.0000000
charge: -0.282969 -0.504815 -0.279261 0.155409 -0.007496 -0.076573 -0.296796 -0.269420 -0.332901 0.397028 0.055457 -0.226199 -0.328771 0.062966 -0.072958 -0.281061 -0.046326 0.169680 -0.046414 0.062432 -0.226910 -0.198252 -0.134223 -0.126288 -0.215134 0.098437 0.089327 0.100032 0.102533 0.088522 0.092844 0.093974 0.100632 0.127260 0.092568 0.091567 0.102860 0.121760 0.089340 0.088569 0.117892 0.121619 0.160216 0.177551 0.111687 0.115916 0.142207 0.141109 0.160185 0.158491 0.162698
qa: -0.2830 -0.5048 -0.2793 0.1554 -0.0075 -0.0766 -0.2968 -0.2694 -0.3329 0.3970 0.0555 -0.2262 -0.3288 0.0630 -0.0730 -0.2811 -0.0463 0.1697 -0.0464 0.0624 -0.2269 -0.1983 -0.1342 -0.1263 -0.2151 0.0984 0.0893 0.1000 0.1025 0.0885 0.0928 0.0940 0.1006 0.1273 0.0926 0.0916 0.1029 0.1218 0.0893 0.0886 0.1179 0.1216 0.1602 0.1776 0.1117 0.1159 0.1422 0.1411 0.1602 0.1585 0.1627
va: 2.1020 1.9920 2.2524 3.7565 3.7580 3.8199 3.9179 3.8721 3.8795 4.1520 3.6354 3.9093 3.9885 3.8488 3.6282 3.9797 3.9146 3.6626 3.8024 3.5384 3.8928 3.9465 3.8058 3.8457 3.8634 1.0255 1.0304 1.0014 0.9987 1.0023 1.0146 1.0007 1.0001 1.0065 1.0106 0.9965 0.9935 1.0002 1.0161 0.9876 1.0003 1.0057 1.0160 0.9936 1.0095 1.0088 1.0053 1.0056 0.9891 0.9899 0.9889
dispcorr: -0.029673393 hartree
energy: -1079.765626095433
dipole: 12.44722 -12.29375 0.15347 15.23892 -14.91750 0.32142 2.21082 -1.09385 1.11696
magnitude: 1.17238 au
magnitude: 2.97995 debye
