program: Orca
programVersion: 5.0.2
elementType: O O O C C C C C C C C C C C C C C C C C C C C C C H H H H H H H H H H H H H H H H H H H H H H H H H H
charge: 0
multiplicity: 1
keywords: wb97x-d3
keywords: def2-TZVPP
keywords: def2/J RIJCOSX
keywords: DEFGRID2
keywords: scfconv7
keywords: smallprint printgap noloewdin
keywords: NOSOSCF
formula: C22H26O3
InChI: InChI=1/C22H26O3/c1-15(2)10-19-20(22(19,3)4)21(23)25-14-17-12-18(24-13-17)11-16-8-6-5-7-9-16/h5-10,12-13,19-20H,11,14H2,1-4H3
51 atoms
O  1.465031 -2.298919 -1.221875
O  1.994744 -1.869775 0.906403
O  -2.177033 -3.221622 1.300155
C  3.547996 0.584304 -0.310107
C  2.172985 1.0269 0.079947
C  2.342999 -0.206298 -0.787109
C  4.276385 1.351704 -1.386408
C  4.465923 0.042792 0.756821
C  1.506018 2.218902 -0.498154
C  1.944589 -1.517784 -0.250619
C  1.349608 3.388359 0.128515
C  0.613104 4.522116 -0.516158
C  1.867325 3.669128 1.505198
C  0.786703 -3.502939 -0.843088
C  -0.48146 -3.182833 -0.132244
C  -1.366746 -2.095976 -0.42719
C  -1.020482 -3.825857 0.926342
C  -2.370664 -2.159805 0.478553
C  -3.570959 -1.312149 0.718061
C  -3.34321 0.112173 0.281685
C  -2.368587 0.889051 0.907815
C  -4.091933 0.678149 -0.743192
C  -2.150613 2.201012 0.517675
C  -3.874811 1.993958 -1.138804
C  -2.902212 2.75786 -0.511566
H  1.919196 0.808676 1.113422
H  2.105441 -0.068508 -1.83629
H  3.610823 1.704232 -2.173992
H  5.041121 0.727555 -1.852196
H  4.775768 2.224008 -0.9596
H  3.934642 -0.391897 1.599974
H  5.084587 0.853912 1.145608
H  5.138828 -0.71535 0.35179
H  1.106456 2.115508 -1.502905
H  -0.231939 4.839118 0.101228
H  1.257843 5.397944 -0.625923
H  0.230388 4.258006 -1.50169
H  2.519115 4.546259 1.495517
H  1.046346 3.904439 2.18782
H  2.433513 2.84282 1.931619
H  1.428773 -4.150893 -0.243541
H  0.594673 -4.008877 -1.788799
H  -1.254873 -1.352714 -1.200924
H  -0.709845 -4.682371 1.504018
H  -3.817207 -1.338065 1.783075
H  -4.43762 -1.725202 0.194328
H  -1.774857 0.462694 1.708119
H  -4.853599 0.087095 -1.237792
H  -1.395383 2.792774 1.019073
H  -4.468733 2.418454 -1.938004
H  -2.731539 3.782333 -0.81674
elementType: O C H
totalener: -1079.73765875 hartree
nucrepener: 2199.18443774 hartree
electener: -3278.92209649 hartree
oneelecener: -5837.99308719 hartree
twoeener: 2559.07099070 hartree
cpcmener: -0.03134710 hartree
kineticenergy: 1074.85190692 hartree
xcener: -106.463194729578 hartree
chargesum: -0.0000000
charge: -0.294749 -0.495416 -0.286986 0.174493 -0.009405 -0.115798 -0.271514 -0.299366 -0.269968 0.410459 -0.052078 -0.251423 -0.248100 0.114818 -0.087432 -0.318403 -0.045940 0.196738 -0.022898 0.017670 -0.228339 -0.183536 -0.156353 -0.148337 -0.177874 0.101812 0.090297 0.092166 0.099642 0.096188 0.091486 0.095280 0.101931 0.124337 0.091635 0.110547 0.094986 0.100665 0.096055 0.088351 0.118986 0.117118 0.160614 0.179267 0.110849 0.099613 0.146418 0.142925 0.178606 0.159982 0.159983
qa: -0.2947 -0.4954 -0.2870 0.1745 -0.0094 -0.1158 -0.2715 -0.2994 -0.2700 0.4105 -0.0521 -0.2514 -0.2481 0.1148 -0.0874 -0.3184 -0.0459 0.1967 -0.0229 0.0177 -0.2283 -0.1835 -0.1564 -0.1483 -0.1779 0.1018 0.0903 0.0922 0.0996 0.0962 0.0915 0.0953 0.1019 0.1243 0.0916 0.1105 0.0950 0.1007 0.0961 0.0884 0.1190 0.1171 0.1606 0.1793 0.1108 0.0996 0.1464 0.1429 0.1786 0.1600 0.1600
va: 2.1103 2.0009 2.2657 3.6859 3.7633 3.8928 3.9067 3.8937 3.8207 4.1360 3.6804 3.9183 3.9391 3.8167 3.6844 3.9474 3.9494 3.6528 3.7958 3.6288 3.9541 3.9224 3.8297 3.9090 3.8942 1.0218 1.0398 1.0016 1.0028 1.0027 1.0196 1.0007 0.9991 1.0082 0.9920 0.9998 1.0055 0.9975 0.9992 1.0079 1.0058 0.9886 1.0081 0.9926 1.0084 1.0060 1.0030 1.0031 0.9690 0.9899 0.9904
dispcorr: -0.026627346 hartree
energy: -1079.764286093223
dipole: 15.17494 -15.27234 -0.09740 23.73061 -22.97351 0.75711 -1.37920 0.44349 -0.93571
magnitude: 1.20758 au
magnitude: 3.06943 debye
