program: Orca
programVersion: 5.0.2
elementType: O O O C C C C C C C C C C C C C C C C C C C C C C H H H H H H H H H H H H H H H H H H H H H H H H H H
charge: 0
multiplicity: 1
keywords: wb97x-d3
keywords: def2-TZVPP
keywords: def2/J RIJCOSX
keywords: DEFGRID2
keywords: scfconv7
keywords: smallprint printgap noloewdin
keywords: NOSOSCF
formula: C22H26O3
InChI: InChI=1/C22H26O3/c1-15(2)10-19-20(22(19,3)4)21(23)25-14-17-12-18(24-13-17)11-16-8-6-5-7-9-16/h5-10,12-13,19-20H,11,14H2,1-4H3
51 atoms
O  1.361717 -1.994597 -0.786502
O  2.129251 -1.264377 1.182883
O  -2.233272 -1.92366 1.74928
C  4.138037 0.249683 -0.722728
C  3.128674 1.194428 -0.147133
C  2.652126 -0.068057 -0.822404
C  4.813582 0.616698 -2.020278
C  5.031094 -0.525706 0.212365
C  2.827931 2.5094 -0.768201
C  2.03981 -1.141898 -0.019042
C  3.383837 3.666428 -0.399669
C  3.010347 4.957425 -1.061309
C  4.412762 3.779692 0.682716
C  0.687548 -3.090223 -0.139653
C  -0.636813 -2.681374 0.403124
C  -1.892304 -2.723471 -0.286129
C  -0.912129 -2.187288 1.634149
C  -2.827146 -2.25802 0.573729
C  -4.2882 -2.024437 0.449364
C  -4.620303 -0.561733 0.268432
C  -5.184492 0.179628 1.300477
C  -4.347192 0.070527 -0.942795
C  -5.476461 1.527473 1.125257
C  -4.638755 1.414306 -1.121505
C  -5.20594 2.147842 -0.085777
H  3.068843 1.16842 0.937363
H  2.232444 0.04337 -1.816582
H  4.146611 1.135652 -2.707861
H  5.186678 -0.274997 -2.527201
H  5.667879 1.270454 -1.831014
H  5.299086 -1.494297 -0.214505
H  4.585065 -0.699106 1.188942
H  5.957914 0.028228 0.373437
H  2.099924 2.518569 -1.57446
H  3.884073 5.430031 -1.517177
H  2.257086 4.820027 -1.836701
H  2.619129 5.672097 -0.332671
H  5.321796 4.248371 0.297393
H  4.056433 4.422175 1.492026
H  4.692153 2.819725 1.114275
H  1.322859 -3.523903 0.632094
H  0.5599 -3.834038 -0.923711
H  -2.066835 -3.068677 -1.293362
H  -0.302425 -1.988057 2.501018
H  -4.807915 -2.41787 1.326285
H  -4.642615 -2.594709 -0.410856
H  -5.403333 -0.299812 2.24726
H  -3.905978 -0.497232 -1.754197
H  -5.918145 2.091638 1.936571
H  -4.427378 1.889152 -2.071017
H  -5.437459 3.195835 -0.225126
elementType: O C H
totalener: -1079.73984246 hartree
nucrepener: 2064.94686966 hartree
electener: -3144.68671212 hartree
oneelecener: -5569.57811731 hartree
twoeener: 2424.89140519 hartree
cpcmener: -0.02974800 hartree
kineticenergy: 1074.85327919 hartree
xcener: -106.459182640980 hartree
chargesum: 0.0000000
charge: -0.292131 -0.507164 -0.285609 0.131143 -0.009942 -0.116172 -0.272731 -0.297292 -0.261854 0.432264 -0.038912 -0.230628 -0.250283 0.095758 -0.085798 -0.334636 -0.015751 0.205565 -0.058856 0.035410 -0.196392 -0.194708 -0.156848 -0.163145 -0.175643 0.097065 0.092968 0.092691 0.100499 0.096869 0.103473 0.092902 0.096550 0.124374 0.094566 0.090169 0.094926 0.096612 0.101499 0.087335 0.121811 0.122379 0.165555 0.170561 0.110119 0.119471 0.143627 0.146112 0.159999 0.161106 0.161118
qa: -0.2921 -0.5072 -0.2856 0.1311 -0.0099 -0.1162 -0.2727 -0.2973 -0.2619 0.4323 -0.0389 -0.2306 -0.2503 0.0958 -0.0858 -0.3346 -0.0158 0.2056 -0.0589 0.0354 -0.1964 -0.1947 -0.1568 -0.1631 -0.1756 0.0971 0.0930 0.0927 0.1005 0.0969 0.1035 0.0929 0.0966 0.1244 0.0946 0.0902 0.0949 0.0966 0.1015 0.0873 0.1218 0.1224 0.1656 0.1706 0.1101 0.1195 0.1436 0.1461 0.1600 0.1611 0.1611
va: 2.1240 1.9901 2.2714 3.6715 3.7876 3.8825 3.9082 3.8974 3.8603 4.1532 3.7029 3.9275 3.9390 3.7837 3.6273 4.0179 3.9472 3.6199 3.8138 3.6003 3.9484 3.9350 3.8873 3.9033 3.8945 1.0274 1.0358 1.0018 1.0030 1.0015 0.9991 1.0185 1.0008 1.0061 0.9960 1.0074 0.9953 0.9977 0.9984 1.0078 1.0120 0.9968 1.0051 1.0061 1.0105 1.0057 1.0036 1.0024 0.9900 0.9902 0.9894
dispcorr: -0.022271268 hartree
energy: -1079.762113731736
dipole: 24.49131 -24.40545 0.08586 18.89029 -18.86650 0.02380 -6.85933 5.66643 -1.19290
magnitude: 1.19622 au
magnitude: 3.04056 debye
