program: Orca
programVersion: 5.0.2
elementType: O O O C C C C C C C C C C C C C C C C C C C C C C H H H H H H H H H H H H H H H H H H H H H H H H H H
charge: 0
multiplicity: 1
keywords: wb97x-d3
keywords: def2-TZVPP
keywords: def2/J RIJCOSX
keywords: DEFGRID2
keywords: scfconv7
keywords: smallprint printgap noloewdin
keywords: NOSOSCF
formula: C22H26O3
InChI: InChI=1/C22H26O3/c1-15(2)10-19-20(22(19,3)4)21(23)25-14-17-12-18(24-13-17)11-16-8-6-5-7-9-16/h5-10,12-13,19-20H,11,14H2,1-4H3
51 atoms
O  1.276254 -1.933215 -0.847697
O  2.178236 -1.220733 1.07092
O  -2.195688 -1.903425 1.85061
C  4.089269 0.175767 -1.056709
C  3.245838 1.17159 -0.318542
C  2.582856 -0.021532 -0.958718
C  4.617157 0.539932 -2.421778
C  5.031891 -0.70087 -0.27128
C  2.97667 2.528208 -0.853912
C  2.008552 -1.090886 -0.121617
C  3.528803 3.65727 -0.400747
C  3.180791 4.987326 -0.996449
C  4.528611 3.709156 0.712688
C  0.646546 -3.03821 -0.171847
C  -0.655259 -2.645017 0.432353
C  -1.940787 -2.70122 -0.197677
C  -0.877723 -2.151822 1.673649
C  -2.839853 -2.244908 0.703906
C  -4.306453 -2.020717 0.647035
C  -4.646603 -0.556523 0.502106
C  -4.516839 0.069123 -0.7355
C  -5.063788 0.196079 1.594407
C  -4.803046 1.417965 -0.880123
C  -5.350019 1.548519 1.453231
C  -5.220289 2.163285 0.216328
H  3.334093 1.106528 0.761727
H  2.048489 0.160621 -1.885402
H  5.522214 1.144029 -2.329288
H  3.898845 1.10742 -3.012862
H  4.87589 -0.358303 -2.98542
H  4.705815 -0.876532 0.751941
H  6.013356 -0.2256 -0.22025
H  5.16384 -1.670064 -0.756359
H  2.276504 2.596238 -1.681624
H  2.771482 5.659891 -0.238191
H  4.069232 5.481769 -1.397357
H  2.450059 4.901686 -1.8003
H  4.162084 4.326733 1.536511
H  4.783411 2.730517 1.115061
H  5.4550 4.176527 0.36932
H  1.322355 -3.465807 0.568488
H  0.490923 -3.782642 -0.950379
H  -2.16247 -3.04819 -1.194771
H  -0.233396 -1.94429 2.512813
H  -4.784806 -2.42947 1.539898
H  -4.695372 -2.578934 -0.20546
H  -4.191951 -0.506983 -1.594272
H  -5.172753 -0.278629 2.562046
H  -4.703594 1.887633 -1.849956
H  -5.676817 2.121367 2.311411
H  -5.446141 3.215459 0.10419
elementType: O C H
totalener: -1079.74027166 hartree
nucrepener: 2059.74841204 hartree
electener: -3139.48868371 hartree
oneelecener: -5559.17405446 hartree
twoeener: 2419.68537075 hartree
cpcmener: -0.03038305 hartree
kineticenergy: 1074.86151285 hartree
xcener: -106.460727573321 hartree
chargesum: 0.0000000
charge: -0.289308 -0.505903 -0.285844 0.144075 0.004287 -0.135252 -0.266266 -0.291505 -0.278272 0.431581 -0.031195 -0.230318 -0.252421 0.093847 -0.083874 -0.333986 -0.016132 0.201250 -0.057101 0.044493 -0.197916 -0.199180 -0.161380 -0.157020 -0.176987 0.093269 0.092974 0.096412 0.091302 0.098497 0.091148 0.097405 0.102143 0.124168 0.095062 0.094163 0.090212 0.098387 0.088189 0.096432 0.121304 0.122620 0.164785 0.171263 0.111392 0.117559 0.146635 0.142970 0.160259 0.160449 0.161330
qa: -0.2893 -0.5059 -0.2858 0.1441 0.0043 -0.1353 -0.2663 -0.2915 -0.2783 0.4316 -0.0312 -0.2303 -0.2524 0.0938 -0.0839 -0.3340 -0.0161 0.2012 -0.0571 0.0445 -0.1979 -0.1992 -0.1614 -0.1570 -0.1770 0.0933 0.0930 0.0964 0.0913 0.0985 0.0911 0.0974 0.1021 0.1242 0.0951 0.0942 0.0902 0.0984 0.0882 0.0964 0.1213 0.1226 0.1648 0.1713 0.1114 0.1176 0.1466 0.1430 0.1603 0.1604 0.1613
va: 2.1236 1.9921 2.2712 3.6753 3.7679 3.8983 3.9057 3.9030 3.8706 4.1577 3.7035 3.9262 3.9434 3.7859 3.6263 4.0206 3.9451 3.6260 3.8138 3.5838 3.9354 3.9525 3.9003 3.8880 3.8942 1.0294 1.0371 1.0027 1.0025 1.0029 1.0175 1.0009 0.9993 1.0069 0.9953 0.9962 1.0078 0.9979 1.0082 0.9973 1.0127 0.9967 1.0054 1.0051 1.0097 1.0069 1.0021 1.0046 0.9903 0.9897 0.9894
dispcorr: -0.022008784 hartree
energy: -1079.762280446623
dipole: 24.58519 -24.57084 0.01435 18.27049 -18.31183 -0.04134 -8.00408 6.79621 -1.20787
magnitude: 1.20866 au
magnitude: 3.07217 debye
