program: Orca
programVersion: 5.0.2
elementType: O O O C C C C C C C C C C C C C C C C C C C C C C H H H H H H H H H H H H H H H H H H H H H H H H H H
charge: 0
multiplicity: 1
keywords: wb97x-d3
keywords: def2-TZVPP
keywords: def2/J RIJCOSX
keywords: DEFGRID2
keywords: scfconv7
keywords: smallprint printgap noloewdin
keywords: NOSOSCF
formula: C22H26O3
InChI: InChI=1/C22H26O3/c1-15(2)10-19-20(22(19,3)4)21(23)25-14-17-12-18(24-13-17)11-16-8-6-5-7-9-16/h5-10,12-13,19-20H,11,14H2,1-4H3
51 atoms
O  1.467765 -2.309031 -1.232234
O  1.941499 -1.855959 0.904156
O  -2.202524 -3.258617 1.251498
C  3.521747 0.585187 -0.287898
C  2.132155 1.036825 0.03663
C  2.337482 -0.212558 -0.799687
C  4.296419 1.333077 -1.345158
C  4.392267 0.061546 0.827102
C  1.493713 2.217266 -0.59396
C  1.92182 -1.516256 -0.257068
C  1.279174 3.390069 0.008843
C  0.57795 4.509353 -0.697425
C  1.687913 3.693073 1.417221
C  0.788362 -3.512305 -0.858383
C  -0.484902 -3.196209 -0.153643
C  -1.343239 -2.079963 -0.415511
C  -1.052738 -3.870279 0.870083
C  -2.361634 -2.160119 0.472776
C  -3.545751 -1.295099 0.72964
C  -3.274626 0.134386 0.339765
C  -2.338288 0.885613 1.049897
C  -3.934728 0.726764 -0.729872
C  -2.071459 2.199475 0.699096
C  -3.668636 2.044746 -1.085756
C  -2.737197 2.784178 -0.37305
H  1.834313 0.838498 1.062191
H  2.141349 -0.095189 -1.859824
H  3.670105 1.651664 -2.178045
H  5.094095 0.707839 -1.750242
H  4.759577 2.224949 -0.918143
H  3.824068 -0.347654 1.658868
H  5.002978 0.876471 1.220392
H  5.073182 -0.712193 0.467422
H  1.167842 2.101891 -1.623937
H  0.2775 4.236501 -1.708898
H  -0.317433 4.814176 -0.148578
H  1.215472 5.395208 -0.759745
H  2.3268 4.579359 1.44586
H  0.813241 3.925604 2.031398
H  2.229965 2.880453 1.89775
H  1.427995 -4.160317 -0.255926
H  0.602558 -4.018192 -1.805415
H  -1.204367 -1.306825 -1.155007
H  -0.766313 -4.755914 1.415455
H  -3.801956 -1.348204 1.79121
H  -4.416408 -1.670775 0.184596
H  -1.813227 0.436051 1.884902
H  -4.664725 0.15547 -1.290962
H  -1.346733 2.771347 1.26518
H  -4.192661 2.491249 -1.921039
H  -2.53011 3.810507 -0.647568
elementType: O C H
totalener: -1079.73781210 hartree
nucrepener: 2207.93660633 hartree
electener: -3287.67441843 hartree
oneelecener: -5855.55172718 hartree
twoeener: 2567.87730875 hartree
cpcmener: -0.03201382 hartree
kineticenergy: 1074.85773715 hartree
xcener: -106.465071628354 hartree
chargesum: 0.0000000
charge: -0.295166 -0.492802 -0.286918 0.176052 -0.012713 -0.112950 -0.269497 -0.299485 -0.260206 0.405102 -0.057371 -0.254707 -0.248479 0.115032 -0.087969 -0.316817 -0.047973 0.193140 -0.018661 0.018895 -0.227395 -0.185790 -0.151377 -0.146515 -0.180793 0.101871 0.089834 0.091750 0.098971 0.095977 0.092041 0.095007 0.101605 0.124169 0.097022 0.090453 0.110865 0.102770 0.093819 0.089360 0.119160 0.116765 0.160964 0.178923 0.110508 0.100193 0.144341 0.142157 0.176198 0.159283 0.161353
qa: -0.2952 -0.4928 -0.2869 0.1761 -0.0127 -0.1130 -0.2695 -0.2995 -0.2602 0.4051 -0.0574 -0.2547 -0.2485 0.1150 -0.0880 -0.3168 -0.0480 0.1931 -0.0187 0.0189 -0.2274 -0.1858 -0.1514 -0.1465 -0.1808 0.1019 0.0898 0.0918 0.0990 0.0960 0.0920 0.0950 0.1016 0.1242 0.0970 0.0905 0.1109 0.1028 0.0938 0.0894 0.1192 0.1168 0.1610 0.1789 0.1105 0.1002 0.1443 0.1422 0.1762 0.1593 0.1614
va: 2.1093 2.0029 2.2660 3.6894 3.7582 3.8924 3.9063 3.8946 3.8102 4.1370 3.6921 3.9188 3.9371 3.8151 3.6877 3.9481 3.9494 3.6591 3.7989 3.6205 3.9465 3.9229 3.8290 3.9122 3.8893 1.0216 1.0403 1.0021 1.0029 1.0028 1.0197 1.0007 0.9992 1.0081 1.0045 0.9917 1.0000 0.9980 1.0006 1.0077 1.0054 0.9886 1.0077 0.9926 1.0089 1.0055 1.0037 1.0033 0.9726 0.9903 0.9886
dispcorr: -0.026956024 hartree
energy: -1079.764768124075
dipole: 14.89014 -14.95062 -0.06048 23.78914 -23.03269 0.75645 -1.52843 0.58627 -0.94216
magnitude: 1.20977 au
magnitude: 3.07499 debye
