program: Orca
programVersion: 5.0.2
elementType: O O O C C C C C C C C C C C C C C C C C C C C C C H H H H H H H H H H H H H H H H H H H H H H H H H H
charge: 0
multiplicity: 1
keywords: wb97x-d3
keywords: def2-TZVPP
keywords: def2/J RIJCOSX
keywords: DEFGRID2
keywords: scfconv7
keywords: smallprint printgap noloewdin
keywords: NOSOSCF
formula: C22H26O3
InChI: InChI=1/C22H26O3/c1-15(2)10-19-20(22(19,3)4)21(23)25-14-17-12-18(24-13-17)11-16-8-6-5-7-9-16/h5-10,12-13,19-20H,11,14H2,1-4H3
51 atoms
O  1.476185 -1.550047 0.192331
O  1.362543 -0.951273 -1.96048
O  -2.833774 -1.771744 -0.623656
C  2.141142 1.852869 -0.757582
C  3.32067 1.225832 -1.413401
C  2.532083 0.425964 -0.39161
C  2.364736 2.872069 0.333406
C  0.902108 2.126646 -1.573789
C  4.714134 1.648303 -1.119154
C  1.738275 -0.733367 -0.828624
C  5.790041 0.866016 -1.237384
C  7.167332 1.385223 -0.960448
C  5.721489 -0.571131 -1.65084
C  0.66751 -2.712151 -0.065487
C  -0.782669 -2.381225 -0.027309
C  -1.624152 -2.36519 1.132414
C  -1.575845 -2.009565 -1.060003
C  -2.855949 -1.992363 0.717183
C  -4.134587 -1.76019 1.433915
C  -4.449334 -0.290759 1.58773
C  -5.515857 0.289739 0.911191
C  -3.662265 0.508381 2.414614
C  -5.797608 1.642762 1.061172
C  -3.940398 1.858068 2.566252
C  -5.01141 2.430344 1.889277
H  3.145073 0.903182 -2.436638
H  2.983641 0.3191 0.587996
H  1.48803 2.934569 0.980228
H  2.530074 3.862655 -0.094824
H  3.22185 2.633359 0.962506
H  0.001639 2.039019 -0.962915
H  0.795537 1.465646 -2.43063
H  0.939639 3.148367 -1.956371
H  4.859356 2.680741 -0.813622
H  7.6515 0.807459 -0.169022
H  7.805125 1.292461 -1.843145
H  7.15904 2.432309 -0.658496
H  4.705543 -0.922557 -1.824176
H  6.293729 -0.735131 -2.567597
H  6.173501 -1.212421 -0.889925
H  0.918785 -3.405467 0.735027
H  0.95269 -3.174648 -1.010241
H  -1.340764 -2.6098 2.144289
H  -1.40053 -1.890149 -2.117395
H  -4.050419 -2.225856 2.417284
H  -4.954662 -2.262722 0.915905
H  -6.136722 -0.320806 0.266317
H  -2.826741 0.068361 2.947242
H  -6.6329 2.079677 0.529254
H  -3.323716 2.464473 3.2171
H  -5.229796 3.483612 2.007946
elementType: O C H
totalener: -1079.73989444 hartree
nucrepener: 2086.17649676 hartree
electener: -3165.91639120 hartree
oneelecener: -5611.92847878 hartree
twoeener: 2446.01208758 hartree
cpcmener: -0.02902495 hartree
kineticenergy: 1074.85661721 hartree
xcener: -106.460468232867 hartree
chargesum: 0.0000000
charge: -0.291543 -0.509438 -0.285704 0.155624 -0.030189 -0.103565 -0.291640 -0.279274 -0.290400 0.418717 -0.013719 -0.228577 -0.244799 0.094756 -0.087144 -0.327784 -0.018076 0.205017 -0.054312 0.028044 -0.192901 -0.192486 -0.156259 -0.163280 -0.175093 0.101239 0.093564 0.098791 0.099742 0.093141 0.100366 0.091605 0.096805 0.125291 0.094951 0.095912 0.089486 0.079783 0.101424 0.097703 0.120516 0.120910 0.165246 0.171355 0.119414 0.107187 0.142365 0.146423 0.159888 0.159717 0.161202
qa: -0.2915 -0.5094 -0.2857 0.1556 -0.0302 -0.1036 -0.2916 -0.2793 -0.2904 0.4187 -0.0137 -0.2286 -0.2448 0.0948 -0.0871 -0.3278 -0.0181 0.2050 -0.0543 0.0280 -0.1929 -0.1925 -0.1563 -0.1633 -0.1751 0.1012 0.0936 0.0988 0.0997 0.0931 0.1004 0.0916 0.0968 0.1253 0.0950 0.0959 0.0895 0.0798 0.1014 0.0977 0.1205 0.1209 0.1652 0.1714 0.1194 0.1072 0.1424 0.1464 0.1599 0.1597 0.1612
va: 2.1182 1.9847 2.2685 3.6987 3.8297 3.8255 3.9128 3.8874 3.8817 4.1203 3.7026 3.9289 3.9395 3.7958 3.6324 4.0103 3.9420 3.6185 3.8155 3.6124 3.9438 3.9296 3.8863 3.9045 3.8931 1.0262 1.0321 1.0025 0.9993 1.0013 0.9993 1.0178 1.0017 1.0021 0.9965 0.9957 1.0066 1.0152 0.9987 0.9986 0.9959 1.0117 1.0051 1.0057 1.0051 1.0111 1.0034 1.0025 0.9900 0.9909 0.9894
dispcorr: -0.022722971 hartree
energy: -1079.762617415843
dipole: 24.24613 -23.82682 0.41930 13.12017 -13.18383 -0.06366 -1.62683 2.87793 1.25110
magnitude: 1.32103 au
magnitude: 3.35779 debye
