program: Orca
programVersion: 5.0.2
elementType: O O O C C C C C C C C C C C C C C C C C C C C C C H H H H H H H H H H H H H H H H H H H H H H H H H H
charge: 0
multiplicity: 1
keywords: wb97x-d3
keywords: def2-TZVPP
keywords: def2/J RIJCOSX
keywords: DEFGRID2
keywords: scfconv7
keywords: smallprint printgap noloewdin
keywords: NOSOSCF
formula: C22H26O3
InChI: InChI=1/C22H26O3/c1-15(2)10-19-20(22(19,3)4)21(23)25-14-17-12-18(24-13-17)11-16-8-6-5-7-9-16/h5-10,12-13,19-20H,11,14H2,1-4H3
51 atoms
O  1.51824 -1.585475 0.253187
O  1.36609 -1.023367 -1.906881
O  -2.781885 -1.915008 -0.580361
C  2.021505 1.825044 -0.722561
C  3.211966 1.256756 -1.412363
C  2.496329 0.420117 -0.370133
C  2.227549 2.85507 0.361155
C  0.746991 2.035667 -1.501314
C  4.587819 1.757693 -1.158695
C  1.742636 -0.774879 -0.78179
C  5.694264 1.010403 -1.18364
C  7.045857 1.610796 -0.946029
C  5.688949 -0.463604 -1.446286
C  0.733283 -2.769362 0.020546
C  -0.721818 -2.460778 0.045153
C  -1.555775 -2.367179 1.206376
C  -1.524723 -2.174834 -1.006552
C  -2.79343 -2.036627 0.773306
C  -4.067457 -1.752915 1.479431
C  -4.376056 -0.274848 1.524292
C  -3.598858 0.574715 2.308688
C  -5.421342 0.264255 0.783866
C  -3.865593 1.934172 2.356103
C  -5.690769 1.627241 0.828162
C  -4.914943 2.465282 1.61514
H  3.023059 0.928262 -2.431272
H  2.98011 0.337263 0.596227
H  2.324196 3.852739 -0.071057
H  3.118884 2.663046 0.957603
H  1.372658 2.870995 1.038985
H  -0.129731 1.911434 -0.862928
H  0.644174 1.365174 -2.351203
H  0.725115 3.055395 -1.889939
H  4.690192 2.822363 -0.966553
H  7.700877 1.454336 -1.806628
H  6.99174 2.681903 -0.752628
H  7.539477 1.137272 -0.093471
H  6.313058 -0.70061 -2.311518
H  6.119197 -1.007327 -0.601277
H  4.694597 -0.865715 -1.632758
H  0.99513 -3.437822 0.838752
H  1.029755 -3.249504 -0.912035
H  -1.264273 -2.532017 2.231838
H  -1.356413 -2.13114 -2.070809
H  -3.976866 -2.143796 2.493667
H  -4.891338 -2.290607 1.005301
H  -2.779063 0.166557 2.888633
H  -6.034029 -0.385513 0.170559
H  -3.256946 2.580382 2.975182
H  -6.5092 2.032336 0.247374
H  -5.125071 3.526025 1.652981
elementType: O C H
totalener: -1079.73985599 hartree
nucrepener: 2096.99993356 hartree
electener: -3176.73978955 hartree
oneelecener: -5633.59569868 hartree
twoeener: 2456.85590913 hartree
cpcmener: -0.02911284 hartree
kineticenergy: 1074.86774280 hartree
xcener: -106.462601215171 hartree
chargesum: -0.0000000
charge: -0.291658 -0.507548 -0.285866 0.151974 -0.018744 -0.111787 -0.288317 -0.279850 -0.295392 0.417530 -0.016505 -0.228788 -0.242720 0.094084 -0.085090 -0.330884 -0.018879 0.205192 -0.054928 0.033061 -0.196208 -0.194721 -0.163109 -0.155954 -0.174991 0.101973 0.095529 0.099321 0.093387 0.098403 0.099249 0.091145 0.096962 0.124366 0.096007 0.090086 0.094770 0.101487 0.098519 0.081510 0.121122 0.120799 0.165499 0.172422 0.119368 0.107495 0.146458 0.142469 0.159826 0.160450 0.161476
qa: -0.2917 -0.5075 -0.2859 0.1520 -0.0187 -0.1118 -0.2883 -0.2798 -0.2954 0.4175 -0.0165 -0.2288 -0.2427 0.0941 -0.0851 -0.3309 -0.0189 0.2052 -0.0549 0.0331 -0.1962 -0.1947 -0.1631 -0.1560 -0.1750 0.1020 0.0955 0.0993 0.0934 0.0984 0.0992 0.0911 0.0970 0.1244 0.0960 0.0901 0.0948 0.1015 0.0985 0.0815 0.1211 0.1208 0.1655 0.1724 0.1194 0.1075 0.1465 0.1425 0.1598 0.1605 0.1615
va: 2.1168 1.9875 2.2672 3.6965 3.8170 3.8260 3.9096 3.8917 3.8838 4.1232 3.7065 3.9293 3.9366 3.7995 3.6297 4.0091 3.9412 3.6186 3.8158 3.6031 3.9315 3.9467 3.9045 3.8865 3.8936 1.0266 1.0307 0.9997 1.0020 1.0027 0.9995 1.0179 1.0017 1.0027 0.9961 1.0062 0.9965 0.9991 0.9986 1.0143 0.9951 1.0114 1.0052 1.0048 1.0054 1.0113 1.0026 1.0037 0.9908 0.9899 0.9894
dispcorr: -0.023008327 hartree
energy: -1079.762864321418
dipole: 23.48931 -23.07825 0.41106 13.87311 -13.87154 0.00157 -1.29095 2.57235 1.28139
magnitude: 1.34571 au
magnitude: 3.42053 debye
