program: Orca
programVersion: 5.0.2
elementType: O O O C C C C C C C C C C C C C C C C C C C C C C H H H H H H H H H H H H H H H H H H H H H H H H H H
charge: 0
multiplicity: 1
keywords: wb97x-d3
keywords: def2-TZVPP
keywords: def2/J RIJCOSX
keywords: DEFGRID2
keywords: scfconv7
keywords: smallprint printgap noloewdin
keywords: NOSOSCF
formula: C22H26O3
InChI: InChI=1/C22H26O3/c1-15(2)10-19-20(22(19,3)4)21(23)25-14-17-12-18(24-13-17)11-16-8-6-5-7-9-16/h5-10,12-13,19-20H,11,14H2,1-4H3
51 atoms
O  1.612335 -2.123072 -0.214431
O  0.987586 -1.06025 -2.086342
O  -2.181697 -3.432666 1.504242
C  1.286608 1.404704 -0.149535
C  2.416142 1.380911 -1.135473
C  2.101841 0.133097 -0.337982
C  1.458508 2.107676 1.174985
C  -0.12624 1.49431 -0.674306
C  3.699401 2.071617 -0.906918
C  1.513058 -1.045633 -0.994852
C  4.348406 2.793154 -1.825666
C  5.662111 3.442231 -1.515282
C  3.820201 3.00576 -3.220947
C  0.843519 -3.293909 -0.547522
C  -0.502243 -3.177825 0.073944
C  -1.532039 -2.233137 -0.240117
C  -0.95511 -3.874444 1.141909
C  -2.520666 -2.421968 0.663879
C  -3.791725 -1.68731 0.916993
C  -3.520819 -0.229935 1.208203
C  -3.975067 0.768252 0.354046
C  -2.773357 0.133512 2.328368
C  -3.692896 2.105658 0.612385
C  -2.489851 1.465379 2.588173
C  -2.949021 2.457768 1.728549
H  2.093503 1.339801 -2.171096
H  2.772084 -0.095754 0.483309
H  2.44367 1.956685 1.613966
H  0.719422 1.746215 1.893107
H  1.304872 3.182335 1.059371
H  -0.817767 0.943149 -0.035085
H  -0.235709 1.123003 -1.690171
H  -0.44634 2.537071 -0.677491
H  4.144623 1.965053 0.077843
H  5.981894 3.25709 -0.489943
H  6.445292 3.07668 -2.184893
H  5.612465 4.523858 -1.6654
H  3.659974 2.063887 -3.749466
H  2.865177 3.534589 -3.219712
H  4.513695 3.595914 -3.819319
H  1.391954 -4.133699 -0.125842
H  0.794087 -3.431801 -1.627023
H  -1.533058 -1.492594 -1.024177
H  -0.535128 -4.681383 1.722355
H  -4.315859 -2.149287 1.756406
H  -4.452955 -1.773101 0.05259
H  -4.553592 0.499919 -0.522033
H  -2.408294 -0.633344 3.002289
H  -4.05405 2.870689 -0.062838
H  -1.909205 1.73086 3.462403
H  -2.725457 3.497521 1.929001
elementType: O C H
totalener: -1079.73745374 hartree
nucrepener: 2175.36988900 hartree
electener: -3255.10734274 hartree
oneelecener: -5790.20684897 hartree
twoeener: 2535.09950623 hartree
cpcmener: -0.02900704 hartree
kineticenergy: 1074.84871344 hartree
xcener: -106.461609030234 hartree
chargesum: 0.0000000
charge: -0.288481 -0.496668 -0.282467 0.165400 0.038190 -0.101300 -0.288737 -0.279147 -0.311292 0.409091 -0.014788 -0.222561 -0.283792 0.077810 -0.093053 -0.319657 -0.032193 0.219581 -0.028058 -0.014482 -0.158049 -0.166537 -0.168294 -0.183376 -0.162712 0.092188 0.091213 0.093494 0.094610 0.099860 0.037388 0.104052 0.105461 0.119941 0.085634 0.097163 0.097825 0.100724 0.106420 0.095773 0.118879 0.119647 0.166154 0.180309 0.109915 0.102643 0.142294 0.144373 0.159206 0.161331 0.159076
qa: -0.2885 -0.4967 -0.2825 0.1654 0.0382 -0.1013 -0.2887 -0.2791 -0.3113 0.4091 -0.0148 -0.2226 -0.2838 0.0778 -0.0931 -0.3197 -0.0322 0.2196 -0.0281 -0.0145 -0.1580 -0.1665 -0.1683 -0.1834 -0.1627 0.0922 0.0912 0.0935 0.0946 0.0999 0.0374 0.1041 0.1055 0.1199 0.0856 0.0972 0.0978 0.1007 0.1064 0.0958 0.1189 0.1196 0.1662 0.1803 0.1099 0.1026 0.1423 0.1444 0.1592 0.1613 0.1591
va: 2.1125 1.9989 2.2710 3.5977 3.7828 3.8550 3.9128 3.9130 3.8979 4.1740 3.6976 3.9186 3.9400 3.8326 3.7287 3.9471 3.9436 3.6492 3.7946 3.6865 3.8739 3.8622 3.8733 3.8539 3.8286 1.0272 1.0369 1.0082 1.0031 1.0003 1.0121 1.0227 1.0008 1.0103 1.0101 0.9925 0.9928 0.9978 0.9949 1.0045 0.9979 1.0120 1.0119 0.9919 1.0132 1.0074 1.0024 1.0058 0.9907 0.9905 0.9910
dispcorr: -0.026583333 hartree
energy: -1079.764037075048
dipole: 15.47932 -15.37468 0.10463 23.32880 -23.00951 0.31929 -5.37210 6.15725 0.78516
magnitude: 0.85403 au
magnitude: 2.17076 debye
