program: Orca
programVersion: 5.0.2
elementType: O O O C C C C C C C C C C C C C C C C C C C C C C H H H H H H H H H H H H H H H H H H H H H H H H H H
charge: 0
multiplicity: 1
keywords: wb97x-d3
keywords: def2-TZVPP
keywords: def2/J RIJCOSX
keywords: DEFGRID2
keywords: scfconv7
keywords: smallprint printgap noloewdin
keywords: NOSOSCF
formula: C22H26O3
InChI: InChI=1/C22H26O3/c1-15(2)10-19-20(22(19,3)4)21(23)25-14-17-12-18(24-13-17)11-16-8-6-5-7-9-16/h5-10,12-13,19-20H,11,14H2,1-4H3
51 atoms
O  1.092926 -1.433965 -1.475614
O  0.855631 0.782494 -1.691202
O  -2.513502 -2.331106 1.017294
C  3.410325 0.67628 0.165696
C  3.778194 1.109701 -1.221694
C  2.961572 -0.144458 -1.035612
C  4.46698 0.041257 1.035002
C  2.417486 1.503214 0.944256
C  5.163735 0.994682 -1.738828
C  1.544123 -0.18084 -1.435947
C  6.017764 2.010827 -1.888031
C  7.397354 1.790143 -2.429692
C  5.697832 3.430178 -1.534319
C  -0.287714 -1.663972 -1.804792
C  -1.150506 -1.636256 -0.594279
C  -1.478291 -0.526144 0.254123
C  -1.808263 -2.698839 -0.076047
C  -2.304493 -1.003777 1.213063
C  -3.023807 -0.356967 2.340645
C  -4.495228 -0.196865 2.041399
C  -5.403401 -1.199772 2.367153
C  -4.958247 0.945203 1.393275
C  -6.748958 -1.064596 2.050318
C  -6.302627 1.084393 1.078123
C  -7.202308 0.077769 1.404298
H  3.213327 1.965066 -1.580491
H  3.487782 -1.085035 -1.158937
H  5.140768 -0.60525 0.473797
H  4.007603 -0.560535 1.821135
H  5.07236 0.810595 1.518861
H  1.821131 0.878065 1.61205
H  1.735992 2.066471 0.310616
H  2.953181 2.224714 1.564054
H  5.501301 -0.002169 -2.008105
H  7.561754 2.380657 -3.334714
H  8.1560 2.111055 -1.711342
H  7.58226 0.743847 -2.671764
H  5.80289 4.080592 -2.406367
H  4.694134 3.563136 -1.13458
H  6.403171 3.803949 -0.787737
H  -0.311374 -2.654015 -2.257473
H  -0.622456 -0.946767 -2.554725
H  -1.148967 0.495948 0.161126
H  -1.863968 -3.736103 -0.368068
H  -2.568379 0.619028 2.511542
H  -2.886979 -0.938996 3.255525
H  -5.058646 -2.091834 2.876559
H  -4.260607 1.734419 1.138265
H  -7.443842 -1.853589 2.307449
H  -6.648286 1.981421 0.580547
H  -8.25071 0.184001 1.157713
elementType: O C H
totalener: -1079.74055139 hartree
nucrepener: 2043.36114408 hartree
electener: -3123.10169547 hartree
oneelecener: -5526.09440904 hartree
twoeener: 2402.99271357 hartree
cpcmener: -0.02974682 hartree
kineticenergy: 1074.85563087 hartree
xcener: -106.460388859644 hartree
chargesum: -0.0000000
charge: -0.286416 -0.502573 -0.287689 0.158828 -0.005172 -0.138563 -0.266378 -0.303235 -0.272852 0.439932 -0.033438 -0.229654 -0.251370 0.075713 -0.083341 -0.313235 -0.037885 0.203679 -0.054915 0.057652 -0.205352 -0.206662 -0.157454 -0.154168 -0.179214 0.096349 0.093205 0.091305 0.099542 0.096214 0.100626 0.093570 0.099054 0.123743 0.094888 0.094032 0.089925 0.098292 0.088136 0.096518 0.118300 0.119828 0.163596 0.179405 0.111454 0.116121 0.143274 0.144721 0.159812 0.160696 0.161153
qa: -0.2864 -0.5026 -0.2877 0.1588 -0.0052 -0.1386 -0.2664 -0.3032 -0.2729 0.4399 -0.0334 -0.2297 -0.2514 0.0757 -0.0833 -0.3132 -0.0379 0.2037 -0.0549 0.0577 -0.2054 -0.2067 -0.1575 -0.1542 -0.1792 0.0963 0.0932 0.0913 0.0995 0.0962 0.1006 0.0936 0.0991 0.1237 0.0949 0.0940 0.0899 0.0983 0.0881 0.0965 0.1183 0.1198 0.1636 0.1794 0.1115 0.1161 0.1433 0.1447 0.1598 0.1607 0.1612
va: 2.1206 1.9954 2.2695 3.6558 3.7792 3.9108 3.9002 3.9014 3.8678 4.1354 3.7021 3.9259 3.9426 3.8401 3.6837 4.0047 3.9675 3.6654 3.8137 3.5708 3.9551 3.9398 3.8917 3.8865 3.8954 1.0256 1.0378 1.0027 1.0026 1.0026 0.9998 1.0161 1.0024 1.0067 0.9955 0.9963 1.0076 0.9980 1.0083 0.9973 0.9988 1.0081 1.0163 0.9924 1.0100 1.0075 1.0076 1.0031 0.9900 0.9896 0.9893
dispcorr: -0.022606781 hartree
energy: -1079.763158170068
dipole: 30.39900 -29.62663 0.77237 13.93417 -14.28497 -0.35080 -0.33402 0.79807 0.46406
magnitude: 0.96693 au
magnitude: 2.45775 debye
