program: Orca
programVersion: 5.0.2
elementType: O O O C C C C C C C C C C C C C C C C C C C C C C H H H H H H H H H H H H H H H H H H H H H H H H H H
charge: 0
multiplicity: 1
keywords: wb97x-d3
keywords: def2-TZVPP
keywords: def2/J RIJCOSX
keywords: DEFGRID2
keywords: scfconv7
keywords: smallprint printgap noloewdin
keywords: NOSOSCF
formula: C22H26O3
InChI: InChI=1/C22H26O3/c1-15(2)10-19-20(22(19,3)4)21(23)25-14-17-12-18(24-13-17)11-16-8-6-5-7-9-16/h5-10,12-13,19-20H,11,14H2,1-4H3
51 atoms
O  1.63994 -2.160334 -0.158337
O  1.054928 -1.080898 -2.032806
O  -2.232099 -3.336335 1.463318
C  1.379224 1.329259 -0.001384
C  2.452919 1.357502 -1.050044
C  2.201839 0.079624 -0.283385
C  1.611244 1.983054 1.339116
C  -0.060023 1.414538 -0.450274
C  3.734691 2.065257 -0.863809
C  1.578346 -1.082317 -0.94057
C  4.337506 2.863411 -1.751451
C  5.65677 3.502487 -1.435683
C  3.799398 3.1978 -3.109147
C  0.849231 -3.313496 -0.504245
C  -0.515785 -3.160039 0.065299
C  -1.546966 -2.252829 -0.343077
C  -0.993085 -3.787997 1.165077
C  -2.559757 -2.392829 0.543853
C  -3.847379 -1.663653 0.71546
C  -3.604899 -0.207186 1.034682
C  -2.961587 0.156357 2.217361
C  -3.980417 0.790832 0.143026
C  -2.700468 1.48847 2.499711
C  -3.721041 2.127907 0.423952
C  -3.080231 2.480337 1.602186
H  2.067974 1.346061 -2.063857
H  2.916301 -0.16983 0.493612
H  0.926765 1.570156 2.083077
H  1.420995 3.056434 1.278781
H  2.625031 1.843263 1.711477
H  -0.217272 1.053079 -1.464314
H  -0.386576 2.455831 -0.424416
H  -0.713695 0.849873 0.218693
H  4.233578 1.905025 0.087846
H  5.587232 4.592075 -1.48755
H  6.019132 3.233941 -0.443571
H  6.417714 3.20852 -2.163374
H  2.813304 2.784192 -3.3103
H  3.733874 4.281458 -3.234826
H  4.476335 2.840182 -3.889468
H  1.361316 -4.160842 -0.052021
H  0.835555 -3.464313 -1.583272
H  -1.533107 -1.570285 -1.177595
H  -0.580749 -4.54832 1.810158
H  -4.427253 -2.134732 1.512069
H  -4.443086 -1.745588 -0.195375
H  -2.658968 -0.609728 2.922161
H  -4.479524 0.52234 -0.780534
H  -2.19983 1.754245 3.421989
H  -4.020835 2.892539 -0.280963
H  -2.875786 3.520204 1.821366
elementType: O C H
totalener: -1079.73928640 hartree
nucrepener: 2171.59450755 hartree
electener: -3251.33379395 hartree
oneelecener: -5782.69324994 hartree
twoeener: 2531.35945599 hartree
cpcmener: -0.02938589 hartree
kineticenergy: 1074.84638426 hartree
xcener: -106.461388787988 hartree
chargesum: 0.0000000
charge: -0.286851 -0.494888 -0.282077 0.166521 0.030543 -0.103183 -0.283291 -0.298174 -0.286739 0.413825 -0.048982 -0.219534 -0.254214 0.076280 -0.079637 -0.340628 -0.034684 0.233809 -0.031147 -0.016573 -0.163457 -0.163158 -0.171654 -0.164265 -0.171229 0.091394 0.092365 0.095328 0.098874 0.093298 0.104211 0.106300 0.053736 0.120379 0.093738 0.088920 0.093273 0.090703 0.095166 0.097761 0.118318 0.119843 0.163648 0.180085 0.110437 0.103789 0.141728 0.142400 0.159481 0.158908 0.159306
qa: -0.2869 -0.4949 -0.2821 0.1665 0.0305 -0.1032 -0.2833 -0.2982 -0.2867 0.4138 -0.0490 -0.2195 -0.2542 0.0763 -0.0796 -0.3406 -0.0347 0.2338 -0.0311 -0.0166 -0.1635 -0.1632 -0.1717 -0.1643 -0.1712 0.0914 0.0924 0.0953 0.0989 0.0933 0.1042 0.1063 0.0537 0.1204 0.0937 0.0889 0.0933 0.0907 0.0952 0.0978 0.1183 0.1198 0.1636 0.1801 0.1104 0.1038 0.1417 0.1424 0.1595 0.1589 0.1593
va: 2.1142 2.0036 2.2713 3.6074 3.7885 3.8402 3.9076 3.9136 3.8760 4.1759 3.7589 3.9202 3.9413 3.8347 3.7080 3.9458 3.9500 3.6249 3.7933 3.6829 3.8627 3.8818 3.8580 3.8723 3.8427 1.0325 1.0365 1.0021 1.0011 1.0071 1.0195 1.0001 1.0090 1.0110 0.9964 1.0088 0.9958 1.0099 0.9974 0.9962 0.9978 1.0111 1.0139 0.9922 1.0136 1.0078 1.0085 1.0025 0.9912 0.9909 0.9909
dispcorr: -0.026358528 hartree
energy: -1079.765644923732
dipole: 15.80494 -15.70440 0.10054 23.35026 -23.05821 0.29205 -4.54326 5.33835 0.79510
magnitude: 0.85298 au
magnitude: 2.16811 debye
