program: Orca
programVersion: 5.0.2
elementType: O O O C C C C C C C C C C C C C C C C C C C C C C H H H H H H H H H H H H H H H H H H H H H H H H H H
charge: 0
multiplicity: 1
keywords: wb97x-d3
keywords: def2-TZVPP
keywords: def2/J RIJCOSX
keywords: DEFGRID2
keywords: scfconv7
keywords: smallprint printgap noloewdin
keywords: NOSOSCF
formula: C22H26O3
InChI: InChI=1/C22H26O3/c1-15(2)10-19-20(22(19,3)4)21(23)25-14-17-12-18(24-13-17)11-16-8-6-5-7-9-16/h5-10,12-13,19-20H,11,14H2,1-4H3
51 atoms
O  1.508307 -1.706773 0.050569
O  1.178325 -0.864007 -1.996004
O  -2.84375 -1.944925 -0.519849
C  1.935268 1.820956 -0.542788
C  3.091027 1.329262 -1.342101
C  2.411009 0.383825 -0.368057
C  2.191048 2.723506 0.639673
C  0.634633 2.123433 -1.245786
C  4.484149 1.780813 -1.092984
C  1.640956 -0.760719 -0.880538
C  5.577791 1.072752 -1.386982
C  6.950106 1.61746 -1.135456
C  5.534011 -0.301538 -1.979885
C  0.696896 -2.852816 -0.262725
C  -0.745632 -2.535864 -0.098576
C  -1.461372 -2.434638 1.138467
C  -1.63895 -2.223809 -1.066311
C  -2.726902 -2.073856 0.827408
C  -3.915787 -1.75389 1.655831
C  -4.201025 -0.270095 1.686251
C  -5.341776 0.253635 1.089459
C  -3.30743 0.600837 2.307087
C  -5.5911 1.621058 1.115453
C  -3.553209 1.965027 2.335196
C  -4.697594 2.480418 1.737629
H  2.856755 1.113811 -2.381896
H  2.936109 0.191113 0.560388
H  1.359743 2.671007 1.344977
H  2.283839 3.76275 0.317367
H  3.099449 2.461048 1.181888
H  -0.220231 1.941478 -0.591507
H  0.494155 1.543734 -2.154941
H  0.612438 3.17787 -1.527761
H  4.610193 2.771066 -0.664531
H  7.507599 0.971646 -0.452461
H  7.530382 1.661375 -2.060566
H  6.92247 2.619117 -0.707136
H  6.046912 -0.321306 -2.944793
H  6.060884 -1.013055 -1.338928
H  4.522121 -0.673702 -2.131627
H  1.00844 -3.611271 0.452921
H  0.919692 -3.222651 -1.263302
H  -1.072581 -2.612063 2.129137
H  -1.568569 -2.17298 -2.141521
H  -3.720779 -2.117077 2.666456
H  -4.792767 -2.292753 1.288994
H  -6.044863 -0.412511 0.603703
H  -2.412288 0.206676 2.7747
H  -6.485081 2.0129 0.647779
H  -2.852258 2.628019 2.825927
H  -4.890279 3.545088 1.7595
elementType: O C H
totalener: -1079.73995049 hartree
nucrepener: 2106.47978088 hartree
electener: -3186.21973136 hartree
oneelecener: -5652.58653490 hartree
twoeener: 2466.36680354 hartree
cpcmener: -0.02952927 hartree
kineticenergy: 1074.86149551 hartree
xcener: -106.461518772748 hartree
chargesum: -0.0000000
charge: -0.292281 -0.508029 -0.285941 0.155818 -0.030751 -0.103234 -0.291252 -0.277044 -0.289889 0.417802 -0.014200 -0.228375 -0.245563 0.095757 -0.088028 -0.332816 -0.018612 0.206241 -0.054456 0.029761 -0.193121 -0.195148 -0.156558 -0.165939 -0.173084 0.100939 0.093172 0.098597 0.099748 0.093413 0.098538 0.091217 0.097067 0.125921 0.095109 0.095652 0.089575 0.101685 0.097544 0.080246 0.121718 0.119676 0.165569 0.174814 0.118954 0.108029 0.143481 0.146237 0.159857 0.161060 0.161124
qa: -0.2923 -0.5080 -0.2859 0.1558 -0.0308 -0.1032 -0.2913 -0.2770 -0.2899 0.4178 -0.0142 -0.2284 -0.2456 0.0958 -0.0880 -0.3328 -0.0186 0.2062 -0.0545 0.0298 -0.1931 -0.1951 -0.1566 -0.1659 -0.1731 0.1009 0.0932 0.0986 0.0997 0.0934 0.0985 0.0912 0.0971 0.1259 0.0951 0.0957 0.0896 0.1017 0.0975 0.0802 0.1217 0.1197 0.1656 0.1748 0.1190 0.1080 0.1435 0.1462 0.1599 0.1611 0.1611
va: 2.1149 1.9870 2.2660 3.6991 3.8307 3.8290 3.9121 3.8862 3.8834 4.1210 3.7031 3.9289 3.9403 3.8109 3.6325 4.0010 3.9432 3.6154 3.8181 3.6074 3.9427 3.9264 3.8875 3.9017 3.8915 1.0258 1.0324 1.0028 0.9991 1.0012 0.9995 1.0188 1.0016 1.0020 0.9963 0.9959 1.0065 0.9986 0.9984 1.0150 0.9940 1.0111 1.0056 1.0022 1.0054 1.0103 1.0031 1.0028 0.9900 0.9904 0.9894
dispcorr: -0.023132374 hartree
energy: -1079.763082859831
dipole: 23.32824 -22.81231 0.51593 14.02332 -14.12105 -0.09772 -1.46726 2.70262 1.23536
magnitude: 1.34233 au
magnitude: 3.41193 debye
