program: Orca
programVersion: 5.0.2
elementType: O O O C C C C C C C C C C C C C C C C C C C C C C H H H H H H H H H H H H H H H H H H H H H H H H H H
charge: 0
multiplicity: 1
keywords: wb97x-d3
keywords: def2-TZVPP
keywords: def2/J RIJCOSX
keywords: DEFGRID2
keywords: scfconv7
keywords: smallprint printgap noloewdin
keywords: NOSOSCF
formula: C22H26O3
InChI: InChI=1/C22H26O3/c1-15(2)10-19-20(22(19,3)4)21(23)25-14-17-12-18(24-13-17)11-16-8-6-5-7-9-16/h5-10,12-13,19-20H,11,14H2,1-4H3
51 atoms
O  1.227776 -1.581805 -1.241757
O  0.839728 0.57001 -1.717911
O  -2.452159 -2.366757 1.234332
C  3.389356 0.816759 0.164456
C  3.707525 1.182217 -1.255348
C  3.005092 -0.12276 -0.96925
C  4.500774 0.337145 1.065316
C  2.331461 1.609332 0.891001
C  5.088341 1.161157 -1.789454
C  1.593957 -0.305418 -1.355336
C  5.780809 2.229333 -2.198195
C  7.174681 2.090937 -2.732068
C  5.265495 3.635132 -2.158589
C  -0.129107 -1.934974 -1.554757
C  -1.020106 -1.807964 -0.370824
C  -1.362507 -0.634403 0.382277
C  -1.707209 -2.822671 0.201755
C  -2.23065 -1.031084 1.340723
C  -2.98163 -0.293949 2.389361
C  -4.449468 -0.188591 2.050168
C  -4.911179 0.849875 1.245519
C  -5.356189 -1.143219 2.50036
C  -6.252912 0.936547 0.902402
C  -6.699358 -1.060857 2.156071
C  -7.151705 -0.020876 1.355425
H  3.062391 1.9546 -1.661938
H  3.607578 -1.022945 -1.02894
H  5.225266 -0.286459 0.542685
H  4.097899 -0.24711 1.89452
H  5.038876 1.186851 1.490461
H  1.807079 0.990292 1.622135
H  1.589858 2.045905 0.2251
H  2.800828 2.431817 1.434144
H  5.57157 0.189611 -1.843058
H  7.881828 2.671032 -2.133573
H  7.512053 1.054758 -2.743373
H  7.243428 2.479962 -3.751133
H  5.894297 4.249504 -1.508794
H  5.310589 4.092765 -3.149933
H  4.242432 3.718644 -1.796821
H  -0.086851 -2.973567 -1.879537
H  -0.488697 -1.339818 -2.394873
H  -1.013432 0.374185 0.23164
H  -1.766515 -3.877845 -0.015969
H  -2.54376 0.701271 2.475112
H  -2.855039 -0.784075 3.357993
H  -4.214601 1.598973 0.887257
H  -5.012072 -1.953208 3.13255
H  -6.597452 1.752958 0.280653
H  -7.393746 -1.809045 2.516113
H  -8.198257 0.045749 1.087973
elementType: O C H
totalener: -1079.74102369 hartree
nucrepener: 2044.60757285 hartree
electener: -3124.34859654 hartree
oneelecener: -5528.57794466 hartree
twoeener: 2404.22934812 hartree
cpcmener: -0.03012143 hartree
kineticenergy: 1074.84871909 hartree
xcener: -106.459802165673 hartree
chargesum: -0.0000000
charge: -0.286117 -0.501366 -0.288852 0.151249 0.015371 -0.141750 -0.264289 -0.298122 -0.285384 0.438134 -0.035528 -0.225075 -0.252078 0.077628 -0.082430 -0.312332 -0.038179 0.198112 -0.051915 0.053530 -0.204498 -0.201701 -0.156381 -0.159522 -0.178282 0.093417 0.094188 0.090081 0.099090 0.096567 0.100341 0.092214 0.099616 0.123638 0.093791 0.089351 0.094806 0.096951 0.095898 0.089605 0.118189 0.119974 0.164958 0.178936 0.112311 0.114974 0.144983 0.143555 0.161099 0.160027 0.161218
qa: -0.2861 -0.5014 -0.2889 0.1512 0.0154 -0.1417 -0.2643 -0.2981 -0.2854 0.4381 -0.0355 -0.2251 -0.2521 0.0776 -0.0824 -0.3123 -0.0382 0.1981 -0.0519 0.0535 -0.2045 -0.2017 -0.1564 -0.1595 -0.1783 0.0934 0.0942 0.0901 0.0991 0.0966 0.1003 0.0922 0.0996 0.1236 0.0938 0.0894 0.0948 0.0970 0.0959 0.0896 0.1182 0.1200 0.1650 0.1789 0.1123 0.1150 0.1450 0.1436 0.1611 0.1600 0.1612
va: 2.1213 1.9953 2.2684 3.6625 3.7667 3.9063 3.8978 3.9035 3.8660 4.1334 3.7256 3.9235 3.9440 3.8408 3.6882 4.0089 3.9669 3.6773 3.8131 3.5722 3.9381 3.9533 3.8891 3.8923 3.8945 1.0301 1.0373 1.0036 1.0025 1.0028 0.9996 1.0154 1.0025 1.0077 0.9962 1.0082 0.9957 0.9971 0.9976 1.0086 0.9988 1.0080 1.0148 0.9926 1.0095 1.0070 1.0031 1.0064 0.9895 0.9899 0.9894
dispcorr: -0.022477505 hartree
energy: -1079.763501194258
dipole: 29.11372 -28.31726 0.79646 15.75703 -16.00151 -0.24449 -2.35546 2.83118 0.47572
magnitude: 0.95939 au
magnitude: 2.43858 debye
