program: Orca
programVersion: 5.0.2
elementType: O O O C C C C C C C C C C C C C C C C C C C C C C H H H H H H H H H H H H H H H H H H H H H H H H H H
charge: 0
multiplicity: 1
keywords: wb97x-d3
keywords: def2-TZVPP
keywords: def2/J RIJCOSX
keywords: DEFGRID2
keywords: scfconv7
keywords: smallprint printgap noloewdin
keywords: NOSOSCF
formula: C22H26O3
InChI: InChI=1/C22H26O3/c1-15(2)10-19-20(22(19,3)4)21(23)25-14-17-12-18(24-13-17)11-16-8-6-5-7-9-16/h5-10,12-13,19-20H,11,14H2,1-4H3
51 atoms
O  1.890138 -2.31365 0.355835
O  1.480972 -1.650341 -1.740915
O  -2.427866 -2.719186 -0.338091
C  1.339319 1.062634 -0.083588
C  2.467005 1.075284 -1.075993
C  2.33376 -0.091499 -0.137741
C  1.417822 1.948873 1.133675
C  -0.069134 0.889002 -0.595803
C  3.623967 1.992999 -0.941894
C  1.873222 -1.405233 -0.622602
C  3.833198 3.079794 -1.690818
C  5.043704 3.939994 -1.491504
C  2.899084 3.543031 -2.765816
C  1.113761 -3.510117 0.161555
C  -0.33006 -3.165477 0.233713
C  -1.004025 -2.577127 1.352815
C  -1.243673 -3.219489 -0.761485
C  -2.270405 -2.322133 0.95191
C  -3.41057 -1.626936 1.606849
C  -3.346264 -0.138392 1.356185
C  -2.71348 0.699785 2.270015
C  -3.859301 0.411265 0.184645
C  -2.597372 2.060844 2.021892
C  -3.745343 1.772327 -0.065842
C  -3.11426 2.601619 0.852202
H  2.153375 0.869497 -2.094978
H  3.02068 -0.13137 0.70165
H  1.067769 2.954901 0.893951
H  2.430269 2.034994 1.526671
H  0.781931 1.560935 1.931639
H  -0.701814 0.401159 0.14907
H  -0.125236 0.312413 -1.516689
H  -0.502847 1.869373 -0.802041
H  4.348991 1.754779 -0.168793
H  5.63622 4.000997 -2.408046
H  4.758895 4.96515 -1.241304
H  5.689505 3.565962 -0.697302
H  3.416499 3.620415 -3.725055
H  2.036553 2.893874 -2.900834
H  2.525466 4.544397 -2.538117
H  1.413086 -4.165283 0.977764
H  1.368451 -4.00212 -0.777747
H  -0.589924 -2.360769 2.325371
H  -1.201103 -3.57862 -1.777824
H  -3.364958 -1.822903 2.678481
H  -4.356718 -2.035121 1.245875
H  -2.306285 0.283571 3.184004
H  -4.35471 -0.227593 -0.536997
H  -2.10457 2.698892 2.744145
H  -4.152077 2.186067 -0.979568
H  -3.026497 3.662482 0.657474
elementType: O C H
totalener: -1079.73901637 hartree
nucrepener: 2205.68273795 hartree
electener: -3285.42175432 hartree
oneelecener: -5851.07901391 hartree
twoeener: 2565.65725958 hartree
cpcmener: -0.03064471 hartree
kineticenergy: 1074.86674150 hartree
xcener: -106.465276010372 hartree
chargesum: 0.0000000
charge: -0.290393 -0.484206 -0.280966 0.232513 -0.015951 -0.130627 -0.288593 -0.298793 -0.283234 0.386767 -0.029278 -0.228580 -0.252049 0.098474 -0.057387 -0.352663 -0.036626 0.210925 -0.055521 0.040152 -0.171348 -0.192141 -0.171310 -0.154904 -0.177796 0.095506 0.096713 0.098665 0.097582 0.095927 0.039813 0.102799 0.109836 0.123039 0.094646 0.093720 0.089786 0.097302 0.088253 0.097151 0.123191 0.118406 0.160802 0.178440 0.111025 0.112473 0.139730 0.140600 0.159984 0.158699 0.159447
qa: -0.2904 -0.4842 -0.2810 0.2325 -0.0160 -0.1306 -0.2886 -0.2988 -0.2832 0.3868 -0.0293 -0.2286 -0.2520 0.0985 -0.0574 -0.3527 -0.0366 0.2109 -0.0555 0.0402 -0.1713 -0.1921 -0.1713 -0.1549 -0.1778 0.0955 0.0967 0.0987 0.0976 0.0959 0.0398 0.1028 0.1098 0.1230 0.0946 0.0937 0.0898 0.0973 0.0883 0.0972 0.1232 0.1184 0.1608 0.1784 0.1110 0.1125 0.1397 0.1406 0.1600 0.1587 0.1594
va: 2.1009 2.0149 2.2595 3.5634 3.8091 3.8784 3.9034 3.9016 3.8718 4.2219 3.7082 3.9264 3.9430 3.8277 3.6305 3.9531 3.9477 3.6046 3.8111 3.5921 3.8596 3.9209 3.8473 3.8781 3.8467 1.0259 1.0362 1.0017 1.0045 1.0038 1.0124 1.0244 0.9987 1.0072 0.9954 0.9961 1.0078 0.9982 1.0087 0.9973 0.9920 1.0083 1.0106 0.9959 1.0100 1.0134 1.0038 1.0089 0.9901 0.9904 0.9909
dispcorr: -0.028064440 hartree
energy: -1079.767080809346
dipole: 12.44504 -12.51449 -0.06945 23.90828 -23.36543 0.54285 -2.40135 3.65450 1.25315
magnitude: 1.36745 au
magnitude: 3.47577 debye
