program: Orca
programVersion: 5.0.2
elementType: O O O C C C C C C C C C C C C C C C C C C C C C C H H H H H H H H H H H H H H H H H H H H H H H H H H
charge: 0
multiplicity: 1
keywords: wb97x-d3
keywords: def2-TZVPP
keywords: def2/J RIJCOSX
keywords: DEFGRID2
keywords: scfconv7
keywords: smallprint printgap noloewdin
keywords: NOSOSCF
formula: C22H26O3
InChI: InChI=1/C22H26O3/c1-15(2)10-19-20(22(19,3)4)21(23)25-14-17-12-18(24-13-17)11-16-8-6-5-7-9-16/h5-10,12-13,19-20H,11,14H2,1-4H3
51 atoms
O  1.818004 -2.172769 0.355869
O  1.360735 -1.4913 -1.725054
O  -2.477746 -2.739367 -0.3839
C  1.239615 1.231954 -0.100681
C  2.39575 1.224408 -1.06045
C  2.2129 0.061018 -0.114112
C  1.280681 2.115346 1.122245
C  -0.155192 1.066736 -0.655873
C  3.569477 2.105008 -0.901517
C  1.763295 -1.251756 -0.608962
C  4.135728 2.805028 -1.889084
C  5.337953 3.663357 -1.639358
C  3.621429 2.783067 -3.3052
C  1.086421 -3.394264 0.146389
C  -0.370752 -3.107336 0.207207
C  -1.079987 -2.560189 1.324664
C  -1.270512 -3.18744 -0.798967
C  -2.351152 -2.351249 0.911547
C  -3.523683 -1.705862 1.561944
C  -3.429939 -0.201478 1.457166
C  -2.772379 0.5272 2.444708
C  -3.94195 0.473347 0.352738
C  -2.6335 1.903965 2.335806
C  -3.805871 1.851392 0.241984
C  -3.151657 2.570813 1.233063
H  2.112455 1.01593 -2.087345
H  2.875997 0.017795 0.743648
H  2.265269 2.156323 1.585538
H  0.577041 1.752608 1.874563
H  0.988653 3.135678 0.865546
H  -0.793566 0.521576 0.041977
H  -0.179505 0.548524 -1.610515
H  -0.603884 2.048524 -0.811537
H  3.999686 2.172885 0.093318
H  5.140142 4.704114 -1.908908
H  5.652773 3.638326 -0.596222
H  6.182331 3.342956 -2.255368
H  2.583313 3.113458 -3.369844
H  4.208676 3.438174 -3.947915
H  3.664562 1.782675 -3.740661
H  1.402761 -4.043258 0.960777
H  1.368546 -3.869437 -0.793775
H  -0.684922 -2.338947 2.304267
H  -1.201735 -3.53176 -1.818977
H  -3.548496 -2.000883 2.611588
H  -4.448132 -2.063665 1.10515
H  -2.3675 0.012443 3.308342
H  -4.455275 -0.080789 -0.424272
H  -2.123793 2.456354 3.114775
H  -4.213321 2.363743 -0.620095
H  -3.047247 3.644508 1.147486
elementType: O C H
totalener: -1079.73837057 hartree
nucrepener: 2194.75524727 hartree
electener: -3274.49361784 hartree
oneelecener: -5829.26202461 hartree
twoeener: 2554.76840677 hartree
cpcmener: -0.03083317 hartree
kineticenergy: 1074.85816453 hartree
xcener: -106.463186452757 hartree
chargesum: 0.0000000
charge: -0.290000 -0.488438 -0.279879 0.168793 0.031971 -0.088545 -0.295281 -0.278101 -0.314271 0.383599 -0.012876 -0.222282 -0.284099 0.097447 -0.063698 -0.352386 -0.035153 0.209701 -0.048312 0.034339 -0.163515 -0.191944 -0.191914 -0.162346 -0.163097 0.090519 0.092968 0.095041 0.094328 0.100967 0.046639 0.101841 0.106942 0.120412 0.097121 0.084985 0.097915 0.105290 0.095535 0.101702 0.123135 0.118917 0.161713 0.178937 0.113161 0.108644 0.142330 0.140767 0.161167 0.159401 0.159916
qa: -0.2900 -0.4884 -0.2799 0.1688 0.0320 -0.0885 -0.2953 -0.2781 -0.3143 0.3836 -0.0129 -0.2223 -0.2841 0.0974 -0.0637 -0.3524 -0.0352 0.2097 -0.0483 0.0343 -0.1635 -0.1919 -0.1919 -0.1623 -0.1631 0.0905 0.0930 0.0950 0.0943 0.1010 0.0466 0.1018 0.1069 0.1204 0.0971 0.0850 0.0979 0.1053 0.0955 0.1017 0.1231 0.1189 0.1617 0.1789 0.1132 0.1086 0.1423 0.1408 0.1612 0.1594 0.1599
va: 2.1030 2.0091 2.2629 3.5997 3.7963 3.8297 3.9138 3.9090 3.8966 4.2126 3.6944 3.9187 3.9405 3.8292 3.6365 3.9602 3.9507 3.6186 3.8049 3.6030 3.8610 3.9158 3.8677 3.8752 3.8376 1.0281 1.0353 1.0087 1.0030 1.0006 1.0090 1.0256 0.9984 1.0100 0.9929 1.0102 0.9924 0.9951 1.0047 0.9971 0.9921 1.0077 1.0102 0.9959 1.0081 1.0163 1.0023 1.0069 0.9900 0.9902 0.9904
dispcorr: -0.027300722 hartree
energy: -1079.765671287708
dipole: 14.08719 -14.06880 0.01839 22.27439 -21.87104 0.40334 -3.62459 4.80545 1.18086
magnitude: 1.24798 au
magnitude: 3.17211 debye
