program: Orca
programVersion: 5.0.2
elementType: O O O C C C C C C C C C C C C C C C C C C C C C C H H H H H H H H H H H H H H H H H H H H H H H H H H
charge: 0
multiplicity: 1
keywords: wb97x-d3
keywords: def2-TZVPP
keywords: def2/J RIJCOSX
keywords: DEFGRID2
keywords: scfconv7
keywords: smallprint printgap noloewdin
keywords: NOSOSCF
formula: C22H26O3
InChI: InChI=1/C22H26O3/c1-15(2)10-19-20(22(19,3)4)21(23)25-14-17-12-18(24-13-17)11-16-8-6-5-7-9-16/h5-10,12-13,19-20H,11,14H2,1-4H3
51 atoms
O  2.064128 -2.025144 0.460453
O  2.248089 -2.058257 -1.764443
O  -2.071793 -2.015514 -0.792319
C  3.841689 0.487709 0.443802
C  2.407189 0.876328 0.392163
C  2.950324 -0.121841 -0.62659
C  4.878272 1.449955 -0.088148
C  4.344685 -0.329689 1.60841
C  1.909864 2.190449 -0.083082
C  2.411706 -1.487339 -0.705595
C  0.735237 2.331957 -0.704289
C  0.243634 3.665791 -1.170193
C  -0.148944 1.150071 -0.994446
C  1.183345 -3.164905 0.433408
C  -0.211427 -2.701358 0.20651
C  -1.112142 -2.186962 1.195143
C  -0.851013 -2.566072 -0.979207
C  -2.225312 -1.78837 0.538083
C  -3.484986 -1.139928 0.983963
C  -3.513059 0.328692 0.634537
C  -2.898797 1.257454 1.470738
C  -4.115002 0.774597 -0.537314
C  -2.893336 2.606344 1.14787
C  -4.109839 2.124948 -0.864846
C  -3.500571 3.044677 -0.022642
H  1.791348 0.41256 1.159505
H  3.117535 0.284209 -1.617807
H  5.158421 2.174364 0.678815
H  4.527808 2.004029 -0.958828
H  5.782543 0.913399 -0.380535
H  5.143854 -1.005418 1.298758
H  3.568027 -0.919831 2.088156
H  4.757797 0.338312 2.366602
H  2.527606 3.065709 0.095894
H  0.027907 3.649399 -2.241682
H  -0.693197 3.93222 -0.673613
H  0.965465 4.460181 -0.981375
H  0.230384 0.575731 -1.84362
H  -0.208925 0.46489 -0.148619
H  -1.16303 1.460218 -1.245813
H  1.289122 -3.62319 1.414315
H  1.503492 -3.888998 -0.314547
H  -0.944715 -2.128735 2.25935
H  -0.58218 -2.816154 -1.99341
H  -3.559972 -1.266993 2.064392
H  -4.345844 -1.647139 0.541958
H  -2.422469 0.919906 2.383893
H  -4.599626 0.063725 -1.195939
H  -2.417077 3.31685 1.810984
H  -4.586661 2.458738 -1.777342
H  -3.499916 4.097162 -0.274276
elementType: O C H
totalener: -1079.73648356 hartree
nucrepener: 2245.61086551 hartree
electener: -3325.34734908 hartree
oneelecener: -5930.56972920 hartree
twoeener: 2605.22238012 hartree
cpcmener: -0.02918944 hartree
kineticenergy: 1074.86983278 hartree
xcener: -106.466510537975 hartree
chargesum: 0.0000000
charge: -0.285078 -0.505223 -0.282802 0.171037 0.006419 -0.093364 -0.291890 -0.278821 -0.350692 0.378061 0.050679 -0.232051 -0.290020 0.074202 -0.062735 -0.320729 -0.024562 0.187717 -0.045521 0.058192 -0.213778 -0.198138 -0.148645 -0.131940 -0.205763 0.104496 0.090659 0.099947 0.093388 0.098735 0.100836 0.091945 0.093186 0.125389 0.104306 0.091349 0.092853 0.118287 0.075023 0.095587 0.114146 0.121711 0.160517 0.169648 0.114400 0.113511 0.141816 0.141536 0.161197 0.158435 0.162540
qa: -0.2851 -0.5052 -0.2828 0.1710 0.0064 -0.0934 -0.2919 -0.2788 -0.3507 0.3781 0.0507 -0.2321 -0.2900 0.0742 -0.0627 -0.3207 -0.0246 0.1877 -0.0455 0.0582 -0.2138 -0.1981 -0.1486 -0.1319 -0.2058 0.1045 0.0907 0.0999 0.0934 0.0987 0.1008 0.0919 0.0932 0.1254 0.1043 0.0913 0.0929 0.1183 0.0750 0.0956 0.1141 0.1217 0.1605 0.1696 0.1144 0.1135 0.1418 0.1415 0.1612 0.1584 0.1625
va: 2.1018 1.9847 2.2571 3.7221 3.7655 3.8156 3.9130 3.8850 3.8873 4.1567 3.6308 3.9147 3.9644 3.8266 3.6159 3.9704 3.9182 3.6193 3.7980 3.5428 3.8840 3.9446 3.8116 3.8548 3.8582 1.0196 1.0319 0.9996 1.0016 1.0022 0.9998 1.0148 1.0008 1.0047 0.9944 0.9961 1.0079 1.0059 1.0013 1.0115 0.9980 1.0126 1.0068 1.0058 1.0091 1.0089 1.0047 1.0067 0.9888 0.9901 0.9891
dispcorr: -0.029961268 hartree
energy: -1079.766444831025
dipole: 10.88897 -11.24495 -0.35598 16.02292 -15.44225 0.58068 2.59147 -1.11042 1.48106
magnitude: 1.63016 au
magnitude: 4.14355 debye
