program: Orca
programVersion: 5.0.2
elementType: O O O C C C C C C C C C C C C C C C C C C C C C C H H H H H H H H H H H H H H H H H H H H H H H H H H
charge: 0
multiplicity: 1
keywords: wb97x-d3
keywords: def2-TZVPP
keywords: def2/J RIJCOSX
keywords: DEFGRID2
keywords: scfconv7
keywords: smallprint printgap noloewdin
keywords: NOSOSCF
formula: C22H26O3
InChI: InChI=1/C22H26O3/c1-15(2)10-19-20(22(19,3)4)21(23)25-14-17-12-18(24-13-17)11-16-8-6-5-7-9-16/h5-10,12-13,19-20H,11,14H2,1-4H3
51 atoms
O  2.084537 -1.975696 0.474839
O  2.229677 -2.090298 -1.75041
O  -2.072981 -2.087255 -0.751217
C  3.941937 0.476315 0.320101
C  2.516261 0.896127 0.343583
C  2.980458 -0.125156 -0.692261
C  4.966907 1.412192 -0.276722
C  4.492663 -0.343516 1.460966
C  2.017184 2.21795 -0.104766
C  2.417854 -1.484315 -0.715104
C  0.774224 2.387377 -0.566319
C  0.251804 3.730987 -0.965463
C  -0.170066 1.22439 -0.708946
C  1.209287 -3.119949 0.506332
C  -0.192119 -2.683557 0.265599
C  -1.102168 -2.150729 1.236527
C  -0.840173 -2.614649 -0.921381
C  -2.227837 -1.807932 0.569487
C  -3.505256 -1.176368 0.989794
C  -3.56056 0.28495 0.612605
C  -3.094056 1.2542 1.496856
C  -4.035545 0.684829 -0.633387
C  -3.100573 2.596783 1.144695
C  -4.044119 2.027889 -0.988871
C  -3.576068 2.98789 -0.101052
H  1.932733 0.450066 1.14555
H  3.103564 0.260675 -1.698048
H  5.306008 2.134028 0.468686
H  4.579538 1.969977 -1.129185
H  5.841632 0.854949 -0.616853
H  3.731938 -0.909845 1.992919
H  4.968068 0.319662 2.18655
H  5.254591 -1.042703 1.110744
H  2.680772 3.073929 -0.022048
H  1.001983 4.514125 -0.856566
H  -0.089148 3.72689 -2.004061
H  -0.616477 4.006857 -0.360686
H  -0.351658 0.730942 0.24885
H  -1.136274 1.535805 -1.105684
H  0.230699 0.463063 -1.383835
H  1.32329 -3.527976 1.508122
H  1.533256 -3.877959 -0.205732
H  -0.931381 -2.043489 2.2967
H  -0.571863 -2.902218 -1.925966
H  -3.591957 -1.284577 2.071409
H  -4.3494 -1.711336 0.547054
H  -2.720426 0.954364 2.469303
H  -4.407508 -0.056997 -1.330652
H  -2.734874 3.338324 1.843619
H  -4.418386 2.32439 -1.96056
H  -3.583413 4.034588 -0.376864
elementType: O C H
totalener: -1079.73620610 hartree
nucrepener: 2238.04820838 hartree
electener: -3317.78441448 hartree
oneelecener: -5915.44780531 hartree
twoeener: 2597.66339083 hartree
cpcmener: -0.02915571 hartree
kineticenergy: 1074.85020312 hartree
xcener: -106.463068407904 hartree
chargesum: 0.0000000
charge: -0.284778 -0.507034 -0.283500 0.160564 0.019750 -0.098768 -0.291422 -0.275643 -0.358279 0.385369 0.074200 -0.238448 -0.330754 0.076399 -0.054367 -0.344007 -0.023050 0.201635 -0.045237 0.059188 -0.219059 -0.201743 -0.133410 -0.131494 -0.211255 0.103002 0.092447 0.099981 0.092556 0.098969 0.091857 0.093671 0.100585 0.125028 0.093544 0.102370 0.094050 0.097054 0.102088 0.114785 0.114452 0.122127 0.159528 0.169497 0.110725 0.115749 0.140942 0.140568 0.159893 0.157637 0.162041
qa: -0.2848 -0.5070 -0.2835 0.1606 0.0197 -0.0988 -0.2914 -0.2756 -0.3583 0.3854 0.0742 -0.2384 -0.3308 0.0764 -0.0544 -0.3440 -0.0231 0.2016 -0.0452 0.0592 -0.2191 -0.2017 -0.1334 -0.1315 -0.2113 0.1030 0.0924 0.1000 0.0926 0.0990 0.0919 0.0937 0.1006 0.1250 0.0935 0.1024 0.0941 0.0971 0.1021 0.1148 0.1145 0.1221 0.1595 0.1695 0.1107 0.1157 0.1409 0.1406 0.1599 0.1576 0.1620
va: 2.1002 1.9824 2.2580 3.7350 3.7521 3.8150 3.9125 3.8824 3.8839 4.1515 3.6024 3.9138 3.9841 3.8211 3.6031 3.9714 3.9254 3.5968 3.7993 3.5474 3.8892 3.9409 3.8047 3.8505 3.8585 1.0243 1.0300 0.9994 1.0018 1.0023 1.0148 1.0006 0.9997 1.0049 1.0093 0.9939 0.9948 0.9917 1.0112 1.0047 0.9980 1.0119 1.0080 1.0060 1.0108 1.0082 1.0046 1.0091 0.9891 0.9904 0.9895
dispcorr: -0.029720143 hartree
energy: -1079.765926240892
dipole: 11.18098 -11.50779 -0.32681 16.22981 -15.61566 0.61415 2.86143 -1.33895 1.52248
magnitude: 1.67390 au
magnitude: 4.25470 debye
