program: Orca
programVersion: 5.0.2
elementType: O O O C C C C C C C C C C C C C C C C C C C C C C H H H H H H H H H H H H H H H H H H H H H H H H H H
charge: 0
multiplicity: 1
keywords: wb97x-d3
keywords: def2-TZVPP
keywords: def2/J RIJCOSX
keywords: DEFGRID2
keywords: scfconv7
keywords: smallprint printgap noloewdin
keywords: NOSOSCF
formula: C22H26O3
InChI: InChI=1/C22H26O3/c1-15(2)10-19-20(22(19,3)4)21(23)25-14-17-12-18(24-13-17)11-16-8-6-5-7-9-16/h5-10,12-13,19-20H,11,14H2,1-4H3
51 atoms
O  1.840473 -2.156876 -0.900225
O  2.263005 -1.702266 1.250197
O  -2.525745 -2.352592 -0.761413
C  4.115114 0.563986 0.098279
C  2.76489 1.113066 0.388856
C  2.893734 -0.14796 -0.458873
C  4.966176 1.250154 -0.943158
C  4.92416 -0.046154 1.215847
C  2.22026 2.352429 -0.216916
C  2.330286 -1.394523 0.079524
C  0.929443 2.494318 -0.531506
C  0.381755 3.773061 -1.08194
C  -0.053764 1.372261 -0.340998
C  1.004494 -3.274624 -0.548156
C  -0.396482 -2.820308 -0.338018
C  -0.962846 -2.144546 0.794197
C  -1.395978 -2.912015 -1.245869
C  -2.253561 -1.881336 0.483543
C  -3.34168 -1.168977 1.205227
C  -3.463361 0.278662 0.785814
C  -3.926006 0.620967 -0.483672
C  -3.089627 1.296901 1.657348
C  -4.004206 1.950295 -0.873413
C  -3.169981 2.629037 1.271089
C  -3.624215 2.959962 0.002547
H  2.404947 0.904728 1.394711
H  2.738353 -0.013943 -1.523038
H  5.692856 0.553553 -1.364641
H  5.521832 2.078211 -0.498953
H  4.374416 1.649626 -1.766894
H  5.585225 0.711256 1.641545
H  5.553214 -0.858242 0.846749
H  4.312166 -0.434226 2.026586
H  2.902078 3.184633 -0.367094
H  -0.407422 4.165772 -0.43477
H  1.148246 4.540638 -1.186887
H  -0.077971 3.612633 -2.060398
H  -0.149584 1.093954 0.71074
H  -1.045941 1.643626 -0.700379
H  0.251093 0.470917 -0.877001
H  1.402932 -3.798246 0.320415
H  1.061048 -3.948453 -1.401092
H  -0.474306 -1.888709 1.720386
H  -1.447628 -3.34221 -2.234156
H  -3.12887 -1.221553 2.273277
H  -4.290846 -1.687874 1.04708
H  -4.234379 -0.154324 -1.174662
H  -2.727827 1.046467 2.647604
H  -4.365432 2.19862 -1.863162
H  -2.874622 3.407833 1.962322
H  -3.685707 3.996706 -0.301922
elementType: O C H
totalener: -1079.73756468 hartree
nucrepener: 2216.27605139 hartree
electener: -3296.01361607 hartree
oneelecener: -5872.10787640 hartree
twoeener: 2576.09426033 hartree
cpcmener: -0.02728135 hartree
kineticenergy: 1074.85554105 hartree
xcener: -106.463241723033 hartree
chargesum: 0.0000000
charge: -0.294502 -0.507222 -0.285746 0.162777 0.015761 -0.115645 -0.286498 -0.282039 -0.359928 0.411162 0.070198 -0.236907 -0.310205 0.073857 -0.068785 -0.357652 -0.034188 0.247157 -0.045829 0.031105 -0.195006 -0.221187 -0.132075 -0.118086 -0.208909 0.102777 0.097702 0.098294 0.099981 0.092401 0.094629 0.100049 0.090533 0.123652 0.095308 0.092837 0.101713 0.107543 0.083999 0.111585 0.118612 0.120750 0.161571 0.178172 0.102060 0.117023 0.139133 0.141307 0.158323 0.158752 0.159684
qa: -0.2945 -0.5072 -0.2857 0.1628 0.0158 -0.1156 -0.2865 -0.2820 -0.3599 0.4112 0.0702 -0.2369 -0.3102 0.0739 -0.0688 -0.3577 -0.0342 0.2472 -0.0458 0.0311 -0.1950 -0.2212 -0.1321 -0.1181 -0.2089 0.1028 0.0977 0.0983 0.1000 0.0924 0.0946 0.1000 0.0905 0.1237 0.0953 0.0928 0.1017 0.1075 0.0840 0.1116 0.1186 0.1208 0.1616 0.1782 0.1021 0.1170 0.1391 0.1413 0.1583 0.1588 0.1597
va: 2.0980 1.9876 2.2670 3.7123 3.7846 3.8149 3.9095 3.8853 3.9092 4.1190 3.6286 3.9142 3.9735 3.8434 3.6426 3.9568 3.9649 3.5828 3.7988 3.6022 3.9302 3.8945 3.8597 3.8064 3.8761 1.0274 1.0328 1.0029 0.9997 1.0023 1.0008 0.9990 1.0196 1.0044 0.9946 1.0092 0.9936 0.9912 1.0166 1.0039 1.0108 0.9972 1.0200 0.9932 1.0133 1.0065 1.0159 1.0042 0.9906 0.9895 0.9911
dispcorr: -0.028591298 hartree
energy: -1079.766155978776
dipole: 13.08207 -13.36354 -0.28147 16.63098 -16.24780 0.38318 -1.33544 0.59209 -0.74335
magnitude: 0.88239 au
magnitude: 2.24286 debye
