program: Orca
programVersion: 5.0.2
elementType: O O O C C C C C C C C C C C C C C C C C C C C C C H H H H H H H H H H H H H H H H H H H H H H H H H H
charge: 0
multiplicity: 1
keywords: wb97x-d3
keywords: def2-TZVPP
keywords: def2/J RIJCOSX
keywords: DEFGRID2
keywords: scfconv7
keywords: smallprint printgap noloewdin
keywords: NOSOSCF
formula: C22H26O3
InChI: InChI=1/C22H26O3/c1-15(2)10-19-20(22(19,3)4)21(23)25-14-17-12-18(24-13-17)11-16-8-6-5-7-9-16/h5-10,12-13,19-20H,11,14H2,1-4H3
51 atoms
O  1.446101 -1.8166 -1.105586
O  2.431937 -2.216759 0.859807
O  -1.806062 -2.908708 1.540204
C  1.612409 1.106093 0.070846
C  2.423291 0.924502 -1.17877
C  2.600099 -0.048147 -0.044205
C  1.992201 2.192477 1.045476
C  0.123624 0.864277 0.001853
C  3.547138 1.8314 -1.52963
C  2.161217 -1.455943 -0.044658
C  3.420899 2.941006 -2.261709
C  4.604902 3.794427 -2.598746
C  2.11114 3.420328 -2.807737
C  0.771542 -3.090907 -1.052774
C  -0.448955 -2.96862 -0.214389
C  -1.671852 -2.327007 -0.59126
C  -0.592278 -3.299677 1.090575
C  -2.456758 -2.308586 0.5099
C  -3.768491 -1.664937 0.791346
C  -3.577277 -0.195826 1.088826
C  -3.153312 0.228248 2.345844
C  -3.758278 0.752775 0.086514
C  -2.912294 1.572946 2.593585
C  -3.522552 2.098923 0.332976
C  -3.094996 2.513058 1.587216
H  1.847798 0.555294 -2.022521
H  3.494152 0.085965 0.556237
H  1.595355 1.969781 2.037896
H  1.575736 3.152222 0.732355
H  3.07098 2.312603 1.13883
H  -0.256415 0.444205 0.935792
H  -0.164934 0.201646 -0.811002
H  -0.388608 1.814714 -0.160701
H  4.53295 1.562521 -1.160712
H  4.731787 3.878822 -3.681102
H  4.472497 4.812542 -2.223926
H  5.529967 3.3978 -2.180992
H  1.260387 2.835885 -2.460544
H  1.937872 4.462077 -2.527017
H  2.112983 3.393666 -3.900697
H  1.442928 -3.870337 -0.693786
H  0.519473 -3.31193 -2.087929
H  -1.91694 -1.913572 -1.557389
H  0.049666 -3.801842 1.797154
H  -4.261711 -2.165386 1.626907
H  -4.412829 -1.784056 -0.080263
H  -3.008567 -0.49754 3.137575
H  -4.087836 0.435239 -0.895859
H  -2.58164 1.887711 3.575083
H  -3.672574 2.823941 -0.45671
H  -2.908658 3.561439 1.780807
elementType: O C H
totalener: -1079.73668105 hartree
nucrepener: 2196.36212735 hartree
electener: -3276.09880840 hartree
oneelecener: -5832.02483860 hartree
twoeener: 2555.92603020 hartree
cpcmener: -0.03048449 hartree
kineticenergy: 1074.86199919 hartree
xcener: -106.462859898935 hartree
chargesum: 0.0000000
charge: -0.281194 -0.498927 -0.280895 0.186586 0.016215 -0.136636 -0.283217 -0.372572 -0.280840 0.421697 -0.034628 -0.230093 -0.252067 0.075983 -0.050781 -0.400562 -0.021719 0.243370 -0.041688 0.021408 -0.202685 -0.164229 -0.153628 -0.175080 -0.169266 0.107678 0.096051 0.100941 0.096964 0.094325 0.109124 0.107456 0.105200 0.121487 0.095028 0.095075 0.089529 0.086949 0.096214 0.104326 0.119968 0.120273 0.165369 0.175706 0.110608 0.108748 0.140648 0.139910 0.159056 0.158894 0.159917
qa: -0.2812 -0.4989 -0.2809 0.1866 0.0162 -0.1366 -0.2832 -0.3726 -0.2808 0.4217 -0.0346 -0.2301 -0.2521 0.0760 -0.0508 -0.4006 -0.0217 0.2434 -0.0417 0.0214 -0.2027 -0.1642 -0.1536 -0.1751 -0.1693 0.1077 0.0961 0.1009 0.0970 0.0943 0.1091 0.1075 0.1052 0.1215 0.0950 0.0951 0.0895 0.0869 0.0962 0.1043 0.1200 0.1203 0.1654 0.1757 0.1106 0.1087 0.1406 0.1399 0.1591 0.1589 0.1599
va: 2.1149 1.9926 2.2673 3.6458 3.7790 3.8832 3.9009 3.9157 3.8441 4.1828 3.7077 3.9275 3.9373 3.8314 3.6249 3.9580 3.9577 3.5611 3.8092 3.6125 3.9153 3.8727 3.8783 3.8677 3.8626 1.0171 1.0327 1.0025 1.0006 1.0032 0.9926 1.0064 0.9986 1.0077 0.9949 0.9964 1.0073 1.0075 0.9983 0.9984 1.0109 0.9956 1.0072 1.0017 1.0148 1.0100 1.0101 1.0036 0.9903 0.9910 0.9901
dispcorr: -0.027755270 hartree
energy: -1079.764436319093
dipole: 9.84789 -10.76012 -0.91223 24.66033 -23.55901 1.10132 -9.09331 7.85616 -1.23714
magnitude: 1.89093 au
magnitude: 4.80635 debye
