program: Orca
programVersion: 5.0.2
elementType: O O O C C C C C C C C C C C C C C C C C C C C C C H H H H H H H H H H H H H H H H H H H H H H H H H H
charge: 0
multiplicity: 1
keywords: wb97x-d3
keywords: def2-TZVPP
keywords: def2/J RIJCOSX
keywords: DEFGRID2
keywords: scfconv7
keywords: smallprint printgap noloewdin
keywords: NOSOSCF
formula: C22H26O3
InChI: InChI=1/C22H26O3/c1-15(2)10-19-20(22(19,3)4)21(23)25-14-17-12-18(24-13-17)11-16-8-6-5-7-9-16/h5-10,12-13,19-20H,11,14H2,1-4H3
51 atoms
O  1.458776 -1.753865 -1.069955
O  2.345138 -2.150458 0.943967
O  -1.881498 -2.921959 1.451481
C  1.590469 1.173582 0.091133
C  2.440834 0.963691 -1.128583
C  2.572946 0.012128 0.031293
C  1.946189 2.284622 1.046263
C  0.103408 0.935931 -0.013875
C  3.581189 1.856154 -1.455015
C  2.124307 -1.39344 0.023196
C  3.547602 2.840763 -2.3572
C  4.756521 3.680661 -2.636647
C  2.328729 3.19364 -3.153035
C  0.780633 -3.025781 -1.056734
C  -0.467456 -2.919995 -0.258041
C  -1.677156 -2.26276 -0.65191
C  -0.654925 -3.299128 1.027832
C  -2.498057 -2.284402 0.422802
C  -3.815339 -1.64693 0.690593
C  -3.618996 -0.203483 1.092221
C  -3.233225 0.128427 2.388688
C  -3.748721 0.812489 0.149781
C  -2.976628 1.448584 2.73327
C  -3.498048 2.13452 0.493325
C  -3.106855 2.45628 1.785924
H  1.895564 0.57874 -1.984259
H  3.447504 0.146049 0.659891
H  1.53391 2.086769 2.037142
H  1.529173 3.23202 0.699457
H  3.022002 2.415756 1.154246
H  -0.163575 0.231345 -0.797924
H  -0.398971 1.877651 -0.243429
H  -0.30743 0.56677 0.928583
H  4.507105 1.684988 -0.913092
H  5.036468 3.628033 -3.691961
H  4.559233 4.734271 -2.423006
H  5.617536 3.371467 -2.044308
H  2.077705 4.248631 -3.017899
H  2.50802 3.056295 -4.222625
H  1.45156 2.608438 -2.881923
H  1.438679 -3.812243 -0.687701
H  0.564321 -3.230541 -2.103342
H  -1.890313 -1.812098 -1.609041
H  -0.036011 -3.829475 1.734437
H  -4.346936 -2.1948 1.471284
H  -4.424355 -1.701648 -0.212346
H  -3.130379 -0.650792 3.134958
H  -4.047984 0.566634 -0.862443
H  -2.674969 1.691091 3.74425
H  -3.606643 2.912884 -0.251077
H  -2.906903 3.485371 2.054651
elementType: O C H
totalener: -1079.73727377 hartree
nucrepener: 2191.50410207 hartree
electener: -3271.24137584 hartree
oneelecener: -5822.33704066 hartree
twoeener: 2551.09566482 hartree
cpcmener: -0.03088015 hartree
kineticenergy: 1074.86456642 hartree
xcener: -106.463745618210 hartree
chargesum: 0.0000000
charge: -0.279871 -0.498058 -0.281272 0.207843 0.018607 -0.152249 -0.277163 -0.364855 -0.291173 0.424801 -0.030239 -0.230994 -0.253514 0.074946 -0.048682 -0.405968 -0.022732 0.246555 -0.042088 0.016116 -0.190886 -0.164068 -0.162599 -0.182337 -0.161492 0.105266 0.095640 0.099099 0.095639 0.093482 0.104354 0.105428 0.103495 0.122852 0.094654 0.094884 0.090110 0.096410 0.100686 0.087392 0.120448 0.120166 0.166007 0.175912 0.111228 0.108158 0.141336 0.140260 0.159075 0.159272 0.160119
qa: -0.2799 -0.4981 -0.2813 0.2078 0.0186 -0.1522 -0.2772 -0.3649 -0.2912 0.4248 -0.0302 -0.2310 -0.2535 0.0749 -0.0487 -0.4060 -0.0227 0.2466 -0.0421 0.0161 -0.1909 -0.1641 -0.1626 -0.1823 -0.1615 0.1053 0.0956 0.0991 0.0956 0.0935 0.1044 0.1054 0.1035 0.1229 0.0947 0.0949 0.0901 0.0964 0.1007 0.0874 0.1204 0.1202 0.1660 0.1759 0.1112 0.1082 0.1413 0.1403 0.1591 0.1593 0.1601
va: 2.1145 1.9946 2.2677 3.6408 3.7586 3.9118 3.9004 3.9170 3.8569 4.1717 3.7044 3.9271 3.9423 3.8324 3.6184 3.9616 3.9628 3.5568 3.8099 3.6205 3.9170 3.8671 3.8933 3.8636 3.8537 1.0173 1.0338 1.0027 1.0026 1.0027 1.0072 0.9985 0.9938 1.0078 0.9952 0.9961 1.0075 0.9976 0.9977 1.0080 1.0094 0.9954 1.0070 1.0015 1.0146 1.0105 1.0101 1.0037 0.9905 0.9911 0.9896
dispcorr: -0.027343628 hartree
energy: -1079.764617396860
dipole: 10.60202 -11.43073 -0.82871 24.21973 -23.16007 1.05966 -9.81176 8.49825 -1.31350
magnitude: 1.88014 au
magnitude: 4.77894 debye
